{"text_format":"1","workbook":"xlsx","n_sheets":12,"sheets":["1 Deckblatt St.2024-04-09","2 Zusammenstellung","3 Auszahlung-Zusammenst","4 Honorar+TG, Betreuer","5 Fahrgeld + s.A.","6 Sonstige Kosten","7 Turnierleitung+Schiri","8 Empfangsblatt Team","9 Empfangsblatt TL+Schiri","10 Auszahl-Beschein","11 Anleitung","12 Historie"],"not_rendered":{"charts":0,"images":4,"macros":0,"external_links":0,"defined_names":30,"comments":0,"pivot_tables":0},"unopened":[],"bounds":{"document_bytes":16777216,"sheet_cells":100000,"rows_first":2000,"rows_last":500,"rows_between":2000,"halvings":0,"cell_chars":16384,"cell_head_chars":4096},"cells_cut":0,"cells_raw":0,"read":"whole","date_system":"1900"}

{"sheet":"1 Deckblatt St.2024-04-09","index":0,"n_rows":79,"n_cols":17,"rows_kept":79,"cut":false,"hidden":false,"merged":[[56,1,56,7],[59,9,59,10],[61,2,61,5],[61,6,61,7],[62,3,62,5],[62,6,62,7],[58,1,58,2],[60,1,60,7],[57,1,57,5],[59,1,59,6],[57,9,57,10],[70,1,70,2],[63,1,63,7],[65,1,65,7],[67,1,67,7],[69,1,69,7],[68,1,68,2],[68,3,68,6],[70,3,70,6],[64,3,64,6],[66,3,66,6],[71,1,71,7],[70,12,70,13],[2,1,2,11],[3,1,3,11],[4,1,4,14],[66,1,66,2],[6,1,6,5],[5,9,5,11],[6,6,6,8],[7,1,7,5],[8,1,8,5],[10,1,10,14],[7,6,7,8],[8,6,8,8],[6,9,6,10],[7,9,7,10],[5,12,5,14],[9,1,9,8],[54,1,54,14],[55,1,55,7],[11,1,11,14],[19,1,19,14],[21,1,21,14],[20,1,20,14],[48,7,48,8],[49,9,49,13],[5,6,5,8],[5,1,5,5],[9,9,9,14],[8,9,8,10],[55,8,55,14],[50,9,50,13],[71,8,71,14],[64,9,64,10],[61,9,62,10],[70,9,70,10],[66,9,68,10],[61,12,62,13],[66,12,68,13],[64,12,64,13],[63,11,63,13],[63,9,63,10],[69,9,69,10],[69,11,69,13],[65,8,65,14],[58,11,58,13],[58,9,58,10],[60,8,60,14],[56,12,57,13],[59,12,59,13],[40,12,40,13],[48,9,48,13],[51,9,51,13],[52,9,52,13],[14,1,14,5],[17,1,17,14],[40,7,40,8],[22,7,22,8],[22,12,22,13],[12,1,12,5],[13,1,13,14],[12,6,12,13],[14,6,14,13],[18,1,18,14],[16,6,16,13],[15,1,15,14],[16,1,16,5]]}
[]
[null,null,null,null,null,null,null,null,null,null,null,null,null,null,{"$f":"IF(OR(N3=12345678,N3=\"\"),\"Bitte zutreffende 8-stellige Kostenstellen-Nummer eintragen\",\"\")","v":"Bitte zutreffende 8-stellige Kostenstellen-Nummer eintragen"}]
[null,"Tischtennis Baden-Württemberg e.V."]
[null,"Veranstaltungs-Abrechnung",null,null,null,null,null,null,null,null,null,null,null,"Kostenstelle"]
[]
[null,"Verantwortlicher:",null,null,null,null,"(angeben: Verantwortlicher oder Delegationsleiter)",null,null,"Bankverbindung:"]
[null,"Name, Vorname:",null,null,null,null,null,null,null,"Bank:"]
[null,"PLZ, Wohnort:",null,null,null,null,null,null,null,"BIC:"]
[null,"Straße:",null,null,null,null,null,null,null,"IBAN:"]
[]
[]
[]
[null,"Veranstaltung:"]
[]
[null,"Ort:"]
[]
[null,"Datum:"]
[]
[]
[]
[null,"Teilnehmer:"]
[]
[null,"Spieler:",null,null,null,"Nachname","Vorname","Wohnort",null,null,"Nachname","Vorname","Wohnort"]
[null,null,null,null,1,null,null,null,null,17]
[null,null,null,null,2,null,null,null,null,18]
[null,null,null,null,3,null,null,null,null,19]
[null,null,null,null,4,null,null,null,null,20]
[null,null,null,null,5,null,null,null,null,21]
[null,null,null,null,6,null,null,null,null,22]
[null,null,null,null,7,null,null,null,null,23]
[null,null,null,null,8,null,null,null,null,24]
[null,null,null,null,9,null,null,null,null,25]
[null,null,null,null,10,null,null,null,null,26]
[null,null,null,null,11,null,null,null,null,27]
[null,null,null,null,12,null,null,null,null,28]
[null,null,null,null,13,null,null,null,null,29]
[null,null,null,null,14,null,null,null,null,30]
[null,null,null,null,15,null,null,null,null,31]
[null,null,null,null,16,null,null,null,null,32]
[]
[null,"Betreuer:",null,null,null,"Nachname","Vorname","Wohnort",null,null,"Nachname","Vorname","Wohnort"]
[null,null,null,null,1,null,null,null,null,7]
[null,null,null,null,2,null,null,null,null,8]
[null,null,null,null,3,null,null,null,null,9]
[null,null,null,null,4,null,null,null,null,10]
[null,null,null,null,5,null,null,null,null,11]
[null,null,null,null,6,null,null,null,null,12]
[]
[null,"Sonstige:",null,null,null,"Nachname","Vorname","Wohnort",null,"Funktion"]
[null,null,null,null,13]
[null,null,null,null,14]
[null,null,null,null,15]
[null,null,null,null,16]
[]
[]
[]
[null,null,null,null,null,null,null,null,"(angeben: Verantwortlicher oder Delegationsleiter)"]
[null,"Gesamtkosten",null,null,null,null,{"$f":"'2 Zusammenstellung'!N30","v":0},null,"Verantwortlicher:"]
[]
[null,"(Details auf Blatt \"2 Zusammenstellung\")",null,null,null,null,null,null,null,"(Datum)",null,null,"(Unterschrift)"]
[]
[null,null,"Abrechnung ist ..........",null,null,null,{"$f":"IF(G13=\"\",\"\",IF(AND(C63=\"\",C65=\"\"),\"ein X in Kästchen setzen\",\"\"))","v":""}]
[null,null,null,"vollständig",null,null,{"$f":"IF(G13=\"\",\"\",IF(AND(NOT(C63=\"\"),NOT(C65=\"\")),\"nur ein Kreuz !\",\"\"))","v":""},null,"Freigabe:"]
[]
[null,null,null,"unvollständig, es fehlt noch:",null,null,null,null,null,"(Datum)",null,null,"(Unterschrift)"]
[]
[]
[]
[null,null,null,null,null,null,null,null,"Überweisung:"]
[]
[null,null,null,null,null,null,null,null,null,"(Datum)",null,null,"(Unterschrift)"]
[]
[]
[]
[null,2,3,2,3,14.57,14.57,7,18,3,14.57,14.57,7,18,2,null,{"$f":"SUM(B75:O75)","v":123.28}]
[]
[null,null,null,null,null,"Bearbeiterfunktion"]
[null,null,null,null,null,"Verantwortlicher:"]
[null,null,null,null,null,"Delegationsleiter:"]

{"sheet":"2 Zusammenstellung","index":1,"n_rows":72,"n_cols":15,"rows_kept":72,"cut":false,"hidden":false,"merged":[[48,14,48,15],[47,2,47,4],[55,6,55,7],[55,14,55,15],[54,14,54,15],[50,14,50,15],[51,14,51,15],[52,14,52,15],[64,10,65,13],[54,6,54,7],[52,10,52,12],[52,6,52,7],[56,14,56,15],[56,10,56,12],[60,6,60,7],[56,6,56,7],[60,10,60,12],[60,14,60,15],[62,6,62,7],[57,14,57,15],[58,6,58,7],[57,6,57,7],[61,6,61,7],[59,10,59,12],[4,1,4,12],[5,1,5,15],[27,14,27,15],[32,7,32,9],[36,10,36,12],[48,6,48,7],[39,10,39,12],[42,1,42,15],[38,14,38,15],[38,10,38,12],[35,14,35,15],[37,14,37,15],[37,10,37,12],[41,10,41,12],[40,10,40,12],[41,14,41,15],[44,1,44,15],[45,1,45,7],[46,6,46,7],[48,2,48,4],[46,10,46,12],[41,1,41,2],[41,7,41,9],[47,10,47,12],[1,1,1,12],[9,5,9,11],[18,14,18,15],[2,1,2,12],[3,5,3,12],[9,14,9,15],[3,1,3,4],[1,13,1,15],[2,13,2,14],[11,5,11,11],[7,5,7,11],[11,14,11,15],[10,14,10,15],[15,14,15,15],[16,14,16,15],[14,14,14,15],[18,5,18,11],[8,5,8,11],[8,14,8,15],[17,14,17,15],[12,5,12,11],[15,5,15,11],[10,5,10,11],[12,14,12,15],[17,5,17,11],[25,2,25,4],[26,2,26,4],[13,5,13,11],[24,5,24,11],[24,2,24,4],[14,5,14,11],[3,13,3,14],[4,13,4,15],[6,1,6,15],[7,14,7,15],[14,2,14,4],[19,14,19,15],[13,2,13,4],[16,5,16,11],[7,2,7,4],[8,2,8,4],[19,5,19,11],[21,14,21,15],[20,14,20,15],[25,14,25,15],[22,14,22,15],[13,14,13,15],[12,2,12,4],[18,2,18,4],[15,2,15,4],[16,2,16,4],[17,2,17,4],[19,2,19,4],[20,2,20,4],[21,2,21,4],[22,2,22,4],[9,2,9,4],[10,2,10,4],[11,2,11,4],[54,10,54,12],[23,14,23,15],[23,2,23,4],[22,5,22,11],[20,5,20,11],[21,5,21,11],[48,10,48,12],[28,2,28,4],[38,3,38,4],[25,5,25,11],[24,14,24,15],[23,5,23,11],[31,1,31,5],[32,10,32,12],[28,6,28,11],[35,10,35,12],[31,7,31,15],[33,7,33,9],[28,14,28,15],[33,14,33,15],[40,3,40,4],[40,7,40,9],[51,10,51,12],[49,14,49,15],[40,14,40,15],[39,3,39,4],[30,1,30,15],[34,10,34,12],[34,7,34,9],[27,2,27,4],[58,2,58,4],[59,2,59,4],[43,1,43,15],[57,10,57,12],[53,6,53,7],[41,3,41,4],[57,2,57,4],[49,2,49,4],[50,2,50,4],[51,6,51,7],[51,2,51,4],[47,6,47,7],[53,10,53,12],[45,9,45,15],[46,14,46,15],[53,14,53,15],[47,14,47,15],[46,2,46,4],[26,5,26,11],[34,14,34,15],[61,2,61,4],[62,2,62,4],[63,2,63,4],[52,2,52,4],[53,2,53,4],[54,2,54,4],[55,2,55,4],[56,2,56,4],[39,14,39,15],[39,1,39,2],[40,1,40,2],[37,7,37,9],[35,7,35,9],[32,1,32,2],[36,14,36,15],[33,10,33,12],[36,7,36,9],[32,14,32,15],[26,14,26,15],[29,1,29,11],[29,14,29,15],[27,5,27,11],[60,2,60,4],[71,3,71,4],[71,10,71,12],[64,2,64,4],[65,2,65,4],[66,1,66,4],[64,6,64,7],[67,1,67,15],[65,14,65,15],[66,14,66,15],[66,9,66,12],[61,10,61,12],[65,6,65,7],[66,6,66,7],[64,14,64,15],[62,14,62,15],[33,2,33,3],[34,2,34,3],[35,2,35,3],[36,2,36,3],[37,2,37,4],[50,10,50,12],[49,6,49,7],[38,7,38,9],[38,1,38,2],[39,7,39,9],[50,6,50,7],[49,10,49,12],[59,14,59,15],[63,6,63,7],[58,10,58,12],[62,10,62,12],[61,14,61,15],[63,14,63,15],[59,6,59,7],[63,10,63,12],[58,14,58,15]]}
[]
[]
[null,"Tischtennis Baden-Württemberg e.V.",null,null,null,null,null,null,null,null,null,null,null,{"$f":"IF(Kostenstelle=\"\",\"\",Kostenstelle)","v":""}]
[null,"Veranstaltung:",null,null,null,{"$f":"IF(Veranstaltung=\"\",\"\",Veranstaltung)","v":""},null,null,null,null,null,null,null,"Kostenstelle"]
[]
[]
[null,"Kosten-Zusammenstellung:"]
[null,"P.Nr.","Bezeichnung",null,null,"Erläuterung / Anmerkung",null,null,null,null,null,null,"Kalkulation","Ist-Kosten","Sachkonto"]
[null,1,"Entgelt: Delegationsleiter",null,null,"Honorar: 25,00 €/Tag, max. 75,00 €/Veranstaltung",null,null,null,null,null,null,null,{"$f":"F48","v":0},2517]
[null,2,"Entgelt: Betreuer",null,null,"Honorar: wie (1), nicht hauptamtl. Trainer und Physiotherapeut",null,null,null,null,null,null,null,{"$f":"F49","v":0},2519]
[null,3,"Tagegeld",null,null,"auch Schiedsrichter + Turnierleitung",null,null,null,null,null,null,null,{"$f":"F50+N48+N49","v":0},2569]
[null,4,"Fahrkosten: Öffentl. Verkehrsmittel",null,null,"Bahn, Bus",null,null,null,null,null,null,null,{"$f":"F51+N50+N51","v":0},2560]
[null,5,"km-Geld, Honorartrainer + Deli",null,null,"0,25 €/km",null,null,null,null,null,null,null,{"$f":"F52","v":0},2561]
[null,6,"km-Geld, hauptamtl. Trainer (LSV)",null,null,"0,30 €/km",null,null,null,null,null,null,null,{"$f":"F53","v":0},2562]
[null,7,"km-Geld, Spieler",null,null,"ab 1.7.2011 kein km-Geld für Spieler",null,null,null,null,null,null,null,{"$f":"F54","v":0},2563]
[null,8,"km-Geld, Ehrenamtliche",null,null,"0,30 €/km; auch Schiedsrichter + Turnierleitung",null,null,null,null,null,null,null,{"$f":"F55+N52+N53","v":0},2565]
[null,9,"Mietwagen, Mietbus",null,null,"Miete und Benzin",null,null,null,null,null,null,null,{"$f":"F56+F57","v":0},2566]
[null,10,"Übernachtung: Hotel",null,null,"evtl. mit Frühstück (Abzug bei Tagegeld)",null,null,null,null,null,null,null,{"$f":"F58+N54+N55","v":0},2567]
[null,11,"Übernachtung: Sportschule",null,null,"evtl. mit Verpflegung (Abzug bei Tagegeld)",null,null,null,null,null,null,null,{"$f":"SUM(F59,N56)","v":0},2568]
[null,12,"Bewirtung",null,null,"u.a. Verpflegung Jugendspieler (anstelle Tagegeld)",null,null,null,null,null,null,null,{"$f":"F60","v":0},2570]
[null,13,"Startgeld  (Ausgaben)",null,null,"kommt u.U. nachträglich per Rechnung",null,null,null,null,null,null,null,{"$f":"F61","v":0},2714]
[null,14,"Ausrichterzuschuss",null,null,"bei TTBW-Veranstaltung",null,null,null,null,null,null,null,{"$f":"N57","v":0},2705]
[null,15,"Geschenke, Ehrungen",null,null,"Preisgeld, Medaillen, Urkunden",null,null,null,null,null,null,null,{"$f":"N58","v":0},2802]
[null,16,"Repräsentation",null,null,null,null,null,null,null,null,null,null,{"$f":"N59","v":0},2810]
[null,17,"Dienstleistung: Wäscherei",null,null,null,null,null,null,null,null,null,null,{"$f":"F62","v":0},2662]
[null,18,"./.Startgeld  (Einnahmen)",null,null,"zu entrichten von den Spielern",null,null,null,null,null,null,null,{"$f":"N60","v":0},"2360"]
[null,19,"./. Lehrgangsgebühren",null,null,"20,00 €/Tag",null,null,null,null,null,null,null,{"$f":"F63","v":0},2340]
[null,20,"./. Teilnehmergebühren",null,null,"10,00 / 20,00 €/Tag  (max. 2 Tage)  / Turniere: 40,00 €/Tag",null,null,null,null,null,null,null,{"$f":"F64","v":0},2341]
[null,21,null,null,null,"Sonstiges",{"$f":"IF(N29=0,\"\",\"SK-Nummer eintragen\")","v":""},null,null,null,null,null,null,{"$f":"F65+F66","v":0}]
[null,"Summe Veranstaltungskosten",null,null,null,null,null,null,null,null,null,null,{"$f":"SUM(M9:M29)","v":0},{"$f":"SUM(N9:N29)","v":0}]
[]
[null,"Abrechnung mit Delegationsleiter:",null,null,null,null,null,"Abrechnung mit TTBW-Kasse:"]
[null,"P.Nr./\nDatum",null,"Vorgang","JA\nX","Betrag",null,"Datum",null,null,"Vorgang",null,null,"Betrag","Vorschuss-\nSachkonto"]
[null,null,"kalkulierte Veranstaltungs-Kosten",null,"x",{"$f":"M30","v":0},null,null,null,null,"1. Vorschuss von TTBW-Kasse"]
[null,"(9)","./. Bus-Miete (ohne Benzin)",null,null,{"$f":"IF(E35=\"x\",F56,\"\")","v":""},null,null,null,null,"2. Vorschuss von TTBW-Kasse"]
[null,"10","./. Übernachtung: Hotel+Sportsch.",null,null,{"$f":"IF(E36=\"x\",M18+M19,\"\")","v":""},null,null,null,null,"Vorschuss insgesamt",null,null,{"$f":"SUM(N34:N35)","v":0}]
[null,"13","./. Startgeld",null,null,{"$f":"IF(E37=\"x\",M21,\"\")","v":""},null,null,null,null,"./. Veranstaltungs-Kosten",null,null,{"$f":"(N30)","v":0}]
[null,null,"./. Sonstiges",null,null,null,null,null,null,null,{"$f":"IF(N72>0,\"Rückzahlung\",IF(N72<0,\"Nachforderung\",\"\"))","v":""},null,null,{"$f":"ABS(N72)","v":0}]
[null,null,null,"mind. Vorschuss-Betrag",null,{"$f":"F34-SUM(F35:F38)","v":0}]
[null,null,null,"erteilter Vorschuss"]
[null,null,null,"./. Auslagen Delegationsleiter / VA"]
[null,null,null,{"$f":"IF(F72>0,\"Rückzahlung\",IF(F72<0,\"Nachforderung\",\"\"))","v":""},null,{"$f":"ABS(F72)","v":0}]
[]
[]
[null,"Kosten-Aufteilung: (nur zu informativen Zwecken)"]
[null,"Team-Kosten",null,null,null,null,null,null,null,"Ausrichter-Kosten"]
[null,"P.Nr.","Bezeichnung",null,null,"Kosten","Sachkonto",null,null,"P.Nr.","Bezeichnung",null,null,"Kosten","Sachkonto"]
[null,1,"Entgelt: Delegationsleiter (Honorar)",null,null,{"$f":"'4 Honorar+TG, Betreuer'!$K$88","v":0},2517,null,null,"(3)","Tagegeld:  Turnierleitung",null,null,{"$f":"'7 Turnierleitung+Schiri'!D87","v":0},2569]
[null,2,"Entgelt: Betreuer  (Honorar)",null,null,{"$f":"'4 Honorar+TG, Betreuer'!$K$89","v":0},2519,null,null,"(3)","Tagegeld:  Schiedsrichter",null,null,{"$f":"'7 Turnierleitung+Schiri'!D88","v":0},2569]
[null,"(3)","Tagegeld: Betreuer und Spieler",null,null,{"$f":"'4 Honorar+TG, Betreuer'!$K$90","v":0},2569,null,null,"(4)","FK: Öff. Verkehrsmittel: Turnierleitung",null,null,{"$f":"'7 Turnierleitung+Schiri'!P87","v":0},2560]
[null,"(4)","FK: Öff. Verkehrsmittel: Betreuer + Spieler",null,null,{"$f":"'5 Fahrgeld + s.A.'!D63","v":0},2560,null,null,"(4)","FK: Öff. Verkehrsmittel: Schiedsrichter",null,null,{"$f":"'7 Turnierleitung+Schiri'!P88","v":0},2560]
[null,"5","FK: km-Geld: Honorartrainer + Deli.",null,null,{"$f":"'5 Fahrgeld + s.A.'!D64","v":0},2561,null,null,"(8)","FK: km-Geld:  Turnierleitung",null,null,{"$f":"'7 Turnierleitung+Schiri'!I87","v":0},2565]
[null,"6","FK: km-Geld: hauptamtl. Trainer (LSV)",null,null,{"$f":"'5 Fahrgeld + s.A.'!K63","v":0},2562,null,null,"(8)","FK: km-Geld: Schiedsrichter",null,null,{"$f":"'7 Turnierleitung+Schiri'!I88","v":0},2565]
[null,"7","FK: km-Geld: Spieler (entfällt)",null,null,0,"2563",null,null,"(10)","Übernachtung Hotel: Turnierleitung",null,null,{"$f":"'7 Turnierleitung+Schiri'!U87","v":0},2567]
[null,"(8)","FK: km-Geld: Ehrenamtliche",null,null,{"$f":"('5 Fahrgeld + s.A.'!K64)","v":0},2565,null,null,"(10)","Übernachtung Hotel: Schiedsrichter",null,null,{"$f":"'7 Turnierleitung+Schiri'!U88","v":0},2567]
[null,"9","FK: Miete für Mietfahrzeuge",null,null,{"$f":"'6 Sonstige Kosten'!I15","v":0},2566,null,null,"(11)","Übernachtung: Sportschule, anteilig",null,null,{"$f":"'6 Sonstige Kosten'!L80","v":0},2568]
[null,"9","FK: Benzin für Mietfahrzeuge",null,null,{"$f":"'6 Sonstige Kosten'!M15","v":0},"2566",null,null,"14","Ausrichterzuschuss",null,null,{"$f":"'6 Sonstige Kosten'!O64","v":0},2705]
[null,"(10)","Übernachtung: Hotel, anteilig",null,null,{"$f":"'6 Sonstige Kosten'!O24","v":0},2567,null,null,"15","Geschenke...: Preisgeld, Medaillen, Urk.",null,null,{"$f":"'6 Sonstige Kosten'!F40","v":0},2802]
[null,"(11)","Übernachtung: Sportschule, anteilig",null,null,{"$f":"'6 Sonstige Kosten'!F24","v":0},2568,null,null,"16","Repräsentation",null,null,{"$f":"'6 Sonstige Kosten'!F58","v":0},2810]
[null,"12","Bewirtung",null,null,{"$f":"'6 Sonstige Kosten'!O46","v":0},2570,null,null,"18","./. Startgeld (Einnahmen)",null,null,{"$f":"-('6 Sonstige Kosten'!F31)","v":0},"2360"]
[null,"13","Startgeld  (Ausgaben)",null,null,{"$f":"'6 Sonstige Kosten'!O31","v":0},2714,null,null,null,"Sonstiges"]
[null,"17","Dienstleistung: Wäscherei",null,null,{"$f":"'6 Sonstige Kosten'!O77","v":0},2662,null,null,null,"Sonstiges"]
[null,"19","./. Lehrgangsgebühren",null,null,{"$f":"-('5 Fahrgeld + s.A.'!N62)","v":0},2340]
[null,"20","./. Teilnehmergebühren",null,null,{"$f":"-('5 Fahrgeld + s.A.'!O62)","v":0},2341]
[null,null,"Sonstiges (5 Fahrgeld)",null,null,{"$f":"'5 Fahrgeld + s.A.'!M62","v":0},null,null,null,null,"Pos.Nr. aus obiger Kosten-Zusammenstellung;\nmit (..) nur anteilig"]
[null,null,"Sonstiges (6 Sonstige Kosten)",null,null,{"$f":"'6 Sonstige Kosten'!F77","v":0}]
[null,"Summe Team-Kosten",null,null,null,{"$f":"SUM(F48:F66)","v":0},null,null,null,"Summe Ausrichter-Kosten",null,null,null,{"$f":"SUM(N48:N60)","v":0}]
[]
[]
[]
[]
[null,null,null,"DL Vorschuss-Differenz:",null,{"$f":"F40-F41","v":0},null,null,null,null,"Kasse Vorschuss-Differenz:",null,null,{"$f":"N36-N37","v":0}]

{"sheet":"3 Auszahlung-Zusammenst","index":2,"n_rows":29,"n_cols":23,"rows_kept":29,"cut":false,"hidden":false,"merged":[[2,1,2,13],[3,3,3,13],[2,14,2,15],[6,1,6,16],[8,6,8,7],[8,3,9,3],[8,16,9,16],[8,12,8,13],[8,2,9,2],[3,1,3,2],[5,1,5,16],[8,10,8,11],[8,8,8,9],[3,14,3,15],[7,1,7,16],[8,1,9,1],[28,2,28,4],[8,4,9,4],[8,14,8,15],[8,5,9,5],[27,2,27,4],[26,1,26,16]]}
[]
[]
[null,"Tischtennis Baden-Württemberg e.V.",null,null,null,null,null,null,null,null,null,null,null,null,{"$f":"IF(Kostenstelle=\"\",\"\",Kostenstelle)","v":""}]
[null,"Veranstaltung:",null,{"$f":"IF(Veranstaltung=\"\",\"\",Veranstaltung)","v":""},null,null,null,null,null,null,null,null,null,null,"Kostenstelle"]
[]
[]
[null,"Zusammenstellung Auszahlung"]
[]
[null,"Nr.","Name, Vorname","Wohnort","Funktion","sonst. Funktion","FK: km-Geld",null,"FK: Öffentl VKM",null,"Tagegeld",null,"Honorar",null,"Sonstige Auslagen",null,"Summe"]
[null,null,null,null,null,null,"Betrag  [€]","Sachkonto","Betrag  [€]","Sachkonto","Betrag  [€]","Sachkonto","Betrag  [€]","Sachkonto","Betrag  [€]","Sachkonto",null,null,null,"km-Geld","öff.VKM","Tagegeld","Honorar"]
[null,1,{"$f":"'4 Honorar+TG, Betreuer'!C11","v":"LSV"},{"$f":"IF('1 Deckblatt St.2024-04-09'!H42=\"\",\"\",'1 Deckblatt St.2024-04-09'!H42)","v":""},{"$f":"IF(ISNA(VLOOKUP('5 Fahrgeld + s.A.'!T14,'5 Fahrgeld + s.A.'!$V$14:$X$17,3,FALSE)),\"\",VLOOKUP('5 Fahrgeld + s.A.'!T14,'5 Fahrgeld + s.A.'!$V$14:$X$17,3,FALSE))","v":""},null,{"$f":"IF(C11=\"\",\"\",'5 Fahrgeld + s.A.'!I14)","v":""},{"$f":"IF(C11=\"\",\"\",VLOOKUP(E11,$S$11:$W$13,2,FALSE))","v":{"$error":"#N/A"}},{"$f":"IF(C11=\"\",\"\",'5 Fahrgeld + s.A.'!J14)","v":0},{"$f":"IF(C11=\"\",\"\",VLOOKUP(E11,$S$11:$W$13,3,FALSE))","v":{"$error":"#N/A"}},{"$f":"IF(C11=\"\",\"\",'4 Honorar+TG, Betreuer'!R15)","v":0},{"$f":"IF(C11=\"\",\"\",VLOOKUP(E11,$S$11:$W$13,4,FALSE))","v":{"$error":"#N/A"}},{"$f":"IF(C11=\"\",\"\",'4 Honorar+TG, Betreuer'!S15)","v":0},{"$f":"IF(C11=\"\",\"\",VLOOKUP(E11,$S$11:$W$13,5,FALSE))","v":{"$error":"#N/A"}},{"$f":"IF(C11=\"\",\"\",'5 Fahrgeld + s.A.'!M14)","v":0},{"$f":"'5 Fahrgeld + s.A.'!K14","v":""},{"$f":"IF(C11=\"\",\"\",SUM(G11,I11,K11,M11,O11))","v":0},null,"Honorar-Trainer + Deli",2561,2560,2569,2519]
[null,2,{"$f":"'4 Honorar+TG, Betreuer'!C16","v":"LSV"},{"$f":"IF('1 Deckblatt St.2024-04-09'!H43=\"\",\"\",'1 Deckblatt St.2024-04-09'!H43)","v":""},{"$f":"IF(ISNA(VLOOKUP('5 Fahrgeld + s.A.'!T15,'5 Fahrgeld + s.A.'!$V$14:$X$17,3,FALSE)),\"\",VLOOKUP('5 Fahrgeld + s.A.'!T15,'5 Fahrgeld + s.A.'!$V$14:$X$17,3,FALSE))","v":""},null,{"$f":"IF(C12=\"\",\"\",'5 Fahrgeld + s.A.'!I15)","v":""},{"$f":"IF(C12=\"\",\"\",VLOOKUP(E12,$S$11:$W$13,2,FALSE))","v":{"$error":"#N/A"}},{"$f":"IF(C12=\"\",\"\",'5 Fahrgeld + s.A.'!J15)","v":0},{"$f":"IF(C12=\"\",\"\",VLOOKUP(E12,$S$11:$W$13,3,FALSE))","v":{"$error":"#N/A"}},{"$f":"IF(C12=\"\",\"\",'4 Honorar+TG, Betreuer'!R20)","v":0},{"$f":"IF(C12=\"\",\"\",VLOOKUP(E12,$S$11:$W$13,4,FALSE))","v":{"$error":"#N/A"}},{"$f":"IF(C12=\"\",\"\",'4 Honorar+TG, Betreuer'!S20)","v":0},{"$f":"IF(C12=\"\",\"\",VLOOKUP(E12,$S$11:$W$13,5,FALSE))","v":{"$error":"#N/A"}},{"$f":"IF(C12=\"\",\"\",'5 Fahrgeld + s.A.'!M15)","v":0},{"$f":"'5 Fahrgeld + s.A.'!K15","v":""},{"$f":"IF(C12=\"\",\"\",SUM(G12,I12,K12,M12,O12))","v":0},null,"TTBW-Trainer (LSV)",2562,2560,2569,"----"]
[null,3,{"$f":"'4 Honorar+TG, Betreuer'!C21","v":"LSV"},{"$f":"IF('1 Deckblatt St.2024-04-09'!H44=\"\",\"\",'1 Deckblatt St.2024-04-09'!H44)","v":""},{"$f":"IF(ISNA(VLOOKUP('5 Fahrgeld + s.A.'!T16,'5 Fahrgeld + s.A.'!$V$14:$X$17,3,FALSE)),\"\",VLOOKUP('5 Fahrgeld + s.A.'!T16,'5 Fahrgeld + s.A.'!$V$14:$X$17,3,FALSE))","v":""},null,{"$f":"IF(C13=\"\",\"\",'5 Fahrgeld + s.A.'!I16)","v":""},{"$error":"#N/A"},{"$f":"IF(C13=\"\",\"\",'5 Fahrgeld + s.A.'!J16)","v":0},{"$error":"#N/A"},{"$f":"IF(C13=\"\",\"\",'4 Honorar+TG, Betreuer'!R25)","v":0},{"$error":"#N/A"},{"$f":"IF(C13=\"\",\"\",'4 Honorar+TG, Betreuer'!S25)","v":0},{"$error":"#N/A"},{"$f":"IF(C13=\"\",\"\",'5 Fahrgeld + s.A.'!M16)","v":0},{"$f":"'5 Fahrgeld + s.A.'!K16","v":0},0,null,"Funktionäre u.a.",2565,2560,2569,"----"]
[null,4,{"$f":"'4 Honorar+TG, Betreuer'!C26","v":"LSV"},{"$f":"IF('1 Deckblatt St.2024-04-09'!H45=\"\",\"\",'1 Deckblatt St.2024-04-09'!H45)","v":""},{"$f":"IF(ISNA(VLOOKUP('5 Fahrgeld + s.A.'!T17,'5 Fahrgeld + s.A.'!$V$14:$X$17,3,FALSE)),\"\",VLOOKUP('5 Fahrgeld + s.A.'!T17,'5 Fahrgeld + s.A.'!$V$14:$X$17,3,FALSE))","v":""},null,{"$f":"IF(C14=\"\",\"\",'5 Fahrgeld + s.A.'!I17)","v":""},{"$error":"#N/A"},{"$f":"IF(C14=\"\",\"\",'5 Fahrgeld + s.A.'!J17)","v":0},{"$error":"#N/A"},{"$f":"IF(C14=\"\",\"\",'4 Honorar+TG, Betreuer'!R30)","v":0},{"$error":"#N/A"},{"$f":"IF(C14=\"\",\"\",'4 Honorar+TG, Betreuer'!S30)","v":0},{"$error":"#N/A"},{"$f":"IF(C14=\"\",\"\",'5 Fahrgeld + s.A.'!M17)","v":0},{"$f":"'5 Fahrgeld + s.A.'!K17","v":""},0,null,"Physiotherapeut",2565,2560,2569,"----"]
[null,5,{"$f":"'4 Honorar+TG, Betreuer'!C31","v":"LSV"},{"$f":"IF('1 Deckblatt St.2024-04-09'!H46=\"\",\"\",'1 Deckblatt St.2024-04-09'!H46)","v":""},{"$f":"IF(ISNA(VLOOKUP('5 Fahrgeld + s.A.'!T18,'5 Fahrgeld + s.A.'!$V$14:$X$17,3,FALSE)),\"\",VLOOKUP('5 Fahrgeld + s.A.'!T18,'5 Fahrgeld + s.A.'!$V$14:$X$17,3,FALSE))","v":""},null,{"$f":"IF(C15=\"\",\"\",'5 Fahrgeld + s.A.'!I18)","v":""},{"$error":"#N/A"},{"$f":"IF(C15=\"\",\"\",'5 Fahrgeld + s.A.'!J18)","v":0},{"$error":"#N/A"},{"$f":"IF(C15=\"\",\"\",'4 Honorar+TG, Betreuer'!R35)","v":0},{"$error":"#N/A"},{"$f":"IF(C15=\"\",\"\",'4 Honorar+TG, Betreuer'!S35)","v":0},{"$error":"#N/A"},{"$f":"IF(C15=\"\",\"\",'5 Fahrgeld + s.A.'!M18)","v":0},{"$f":"'5 Fahrgeld + s.A.'!K18","v":""},0,null,"Delegationsleiter",null,2560,2569,2517]
[null,6,{"$f":"'4 Honorar+TG, Betreuer'!C36","v":"LSV"},{"$f":"IF('1 Deckblatt St.2024-04-09'!H47=\"\",\"\",'1 Deckblatt St.2024-04-09'!H47)","v":""},{"$f":"IF(ISNA(VLOOKUP('5 Fahrgeld + s.A.'!T19,'5 Fahrgeld + s.A.'!$V$14:$X$17,3,FALSE)),\"\",VLOOKUP('5 Fahrgeld + s.A.'!T19,'5 Fahrgeld + s.A.'!$V$14:$X$17,3,FALSE))","v":""},null,{"$f":"IF(C16=\"\",\"\",'5 Fahrgeld + s.A.'!I19)","v":""},{"$error":"#N/A"},{"$f":"IF(C16=\"\",\"\",'5 Fahrgeld + s.A.'!J19)","v":0},{"$error":"#N/A"},{"$f":"IF(C16=\"\",\"\",'4 Honorar+TG, Betreuer'!R39)","v":0},{"$error":"#N/A"},{"$f":"IF(C16=\"\",\"\",'4 Honorar+TG, Betreuer'!S39)","v":0},{"$error":"#N/A"},{"$f":"IF(C16=\"\",\"\",'5 Fahrgeld + s.A.'!M19)","v":0},{"$f":"'5 Fahrgeld + s.A.'!K19","v":""},0,null,"Andere",2565,2560,2569,"----"]
[null,7,{"$f":"'4 Honorar+TG, Betreuer'!C40","v":"TTBW"},{"$f":"IF('1 Deckblatt St.2024-04-09'!M42=\"\",\"\",'1 Deckblatt St.2024-04-09'!M42)","v":""},{"$f":"IF(ISNA(VLOOKUP('5 Fahrgeld + s.A.'!T20,'5 Fahrgeld + s.A.'!$V$14:$X$17,3,FALSE)),\"\",VLOOKUP('5 Fahrgeld + s.A.'!T20,'5 Fahrgeld + s.A.'!$V$14:$X$17,3,FALSE))","v":""},null,{"$f":"IF(C17=\"\",\"\",'5 Fahrgeld + s.A.'!I20)","v":""},{"$error":"#N/A"},{"$f":"IF(C17=\"\",\"\",'5 Fahrgeld + s.A.'!J20)","v":0},{"$error":"#N/A"},{"$f":"IF(C17=\"\",\"\",'4 Honorar+TG, Betreuer'!R43)","v":0},{"$error":"#N/A"},{"$f":"IF(C17=\"\",\"\",'4 Honorar+TG, Betreuer'!S43)","v":0},{"$error":"#N/A"},{"$f":"IF(C17=\"\",\"\",'5 Fahrgeld + s.A.'!M20)","v":0},{"$f":"'5 Fahrgeld + s.A.'!K20","v":""},0]
[null,8,{"$f":"'4 Honorar+TG, Betreuer'!C44","v":"TTBW"},{"$f":"IF('1 Deckblatt St.2024-04-09'!M43=\"\",\"\",'1 Deckblatt St.2024-04-09'!M43)","v":""},{"$f":"IF(ISNA(VLOOKUP('5 Fahrgeld + s.A.'!T21,'5 Fahrgeld + s.A.'!$V$14:$X$17,3,FALSE)),\"\",VLOOKUP('5 Fahrgeld + s.A.'!T21,'5 Fahrgeld + s.A.'!$V$14:$X$17,3,FALSE))","v":""},null,{"$f":"IF(C18=\"\",\"\",'5 Fahrgeld + s.A.'!I21)","v":""},{"$error":"#N/A"},{"$f":"IF(C18=\"\",\"\",'5 Fahrgeld + s.A.'!J21)","v":0},{"$error":"#N/A"},{"$f":"IF(C18=\"\",\"\",'4 Honorar+TG, Betreuer'!R47)","v":0},{"$error":"#N/A"},{"$f":"IF(C18=\"\",\"\",'4 Honorar+TG, Betreuer'!S47)","v":0},{"$error":"#N/A"},{"$f":"IF(C18=\"\",\"\",'5 Fahrgeld + s.A.'!M21)","v":0},{"$f":"'5 Fahrgeld + s.A.'!K21","v":""},0]
[null,9,{"$f":"'4 Honorar+TG, Betreuer'!C48","v":"TTBW"},{"$f":"IF('1 Deckblatt St.2024-04-09'!M44=\"\",\"\",'1 Deckblatt St.2024-04-09'!M44)","v":""},{"$f":"IF(ISNA(VLOOKUP('5 Fahrgeld + s.A.'!T22,'5 Fahrgeld + s.A.'!$V$14:$X$17,3,FALSE)),\"\",VLOOKUP('5 Fahrgeld + s.A.'!T22,'5 Fahrgeld + s.A.'!$V$14:$X$17,3,FALSE))","v":""},null,{"$f":"IF(C19=\"\",\"\",'5 Fahrgeld + s.A.'!I22)","v":""},{"$error":"#N/A"},{"$f":"IF(C19=\"\",\"\",'5 Fahrgeld + s.A.'!J22)","v":0},{"$error":"#N/A"},{"$f":"IF(C19=\"\",\"\",'4 Honorar+TG, Betreuer'!R51)","v":0},{"$error":"#N/A"},{"$f":"IF(C19=\"\",\"\",'4 Honorar+TG, Betreuer'!S51)","v":0},{"$error":"#N/A"},{"$f":"IF(C19=\"\",\"\",'5 Fahrgeld + s.A.'!M22)","v":0},{"$f":"'5 Fahrgeld + s.A.'!K22","v":""},0]
[null,10,{"$f":"'4 Honorar+TG, Betreuer'!C52","v":"TTBW"},{"$f":"IF('1 Deckblatt St.2024-04-09'!M45=\"\",\"\",'1 Deckblatt St.2024-04-09'!M45)","v":""},{"$f":"IF(ISNA(VLOOKUP('5 Fahrgeld + s.A.'!T23,'5 Fahrgeld + s.A.'!$V$14:$X$17,3,FALSE)),\"\",VLOOKUP('5 Fahrgeld + s.A.'!T23,'5 Fahrgeld + s.A.'!$V$14:$X$17,3,FALSE))","v":""},null,{"$f":"IF(C20=\"\",\"\",'5 Fahrgeld + s.A.'!I23)","v":""},{"$error":"#N/A"},{"$f":"IF(C20=\"\",\"\",'5 Fahrgeld + s.A.'!J23)","v":0},{"$error":"#N/A"},{"$f":"IF(C20=\"\",\"\",'4 Honorar+TG, Betreuer'!R55)","v":0},{"$error":"#N/A"},{"$f":"IF(C20=\"\",\"\",'4 Honorar+TG, Betreuer'!S55)","v":0},{"$error":"#N/A"},{"$f":"IF(C20=\"\",\"\",'5 Fahrgeld + s.A.'!M23)","v":0},{"$f":"'5 Fahrgeld + s.A.'!K23","v":""},0]
[null,11,{"$f":"'4 Honorar+TG, Betreuer'!C56","v":"TTBW"},{"$f":"IF('1 Deckblatt St.2024-04-09'!M46=\"\",\"\",'1 Deckblatt St.2024-04-09'!M46)","v":""},{"$f":"IF(ISNA(VLOOKUP('5 Fahrgeld + s.A.'!T24,'5 Fahrgeld + s.A.'!$V$14:$X$17,3,FALSE)),\"\",VLOOKUP('5 Fahrgeld + s.A.'!T24,'5 Fahrgeld + s.A.'!$V$14:$X$17,3,FALSE))","v":""},null,{"$f":"IF(C21=\"\",\"\",'5 Fahrgeld + s.A.'!I24)","v":""},{"$error":"#N/A"},{"$f":"IF(C21=\"\",\"\",'5 Fahrgeld + s.A.'!J24)","v":0},{"$error":"#N/A"},{"$f":"IF(C21=\"\",\"\",'4 Honorar+TG, Betreuer'!R59)","v":0},{"$error":"#N/A"},{"$f":"IF(C21=\"\",\"\",'4 Honorar+TG, Betreuer'!S59)","v":0},{"$error":"#N/A"},{"$f":"IF(C21=\"\",\"\",'5 Fahrgeld + s.A.'!M24)","v":0},{"$f":"'5 Fahrgeld + s.A.'!K24","v":""},0]
[null,12,{"$f":"'4 Honorar+TG, Betreuer'!C60","v":"TTBW"},{"$f":"IF('1 Deckblatt St.2024-04-09'!M47=\"\",\"\",'1 Deckblatt St.2024-04-09'!M47)","v":""},{"$f":"IF(ISNA(VLOOKUP('5 Fahrgeld + s.A.'!T25,'5 Fahrgeld + s.A.'!$V$14:$X$17,3,FALSE)),\"\",VLOOKUP('5 Fahrgeld + s.A.'!T25,'5 Fahrgeld + s.A.'!$V$14:$X$17,3,FALSE))","v":""},null,{"$f":"IF(C22=\"\",\"\",'5 Fahrgeld + s.A.'!I25)","v":""},{"$error":"#N/A"},{"$f":"IF(C22=\"\",\"\",'5 Fahrgeld + s.A.'!J25)","v":0},{"$error":"#N/A"},{"$f":"IF(C22=\"\",\"\",'4 Honorar+TG, Betreuer'!R63)","v":0},{"$error":"#N/A"},{"$f":"IF(C22=\"\",\"\",'4 Honorar+TG, Betreuer'!S63)","v":0},{"$error":"#N/A"},{"$f":"IF(C22=\"\",\"\",'5 Fahrgeld + s.A.'!M25)","v":0},{"$f":"'5 Fahrgeld + s.A.'!K25","v":""},0]
[null,13,{"$f":"'4 Honorar+TG, Betreuer'!C64","v":"TTBW"},{"$f":"IF('1 Deckblatt St.2024-04-09'!H50=\"\",\"\",'1 Deckblatt St.2024-04-09'!H50)","v":""},{"$f":"IF(ISNA(VLOOKUP('5 Fahrgeld + s.A.'!T26,'5 Fahrgeld + s.A.'!$V$14:$X$17,3,FALSE)),\"\",VLOOKUP('5 Fahrgeld + s.A.'!T26,'5 Fahrgeld + s.A.'!$V$14:$X$17,3,FALSE))","v":""},{"$f":"IF('1 Deckblatt St.2024-04-09'!J50=\"\",\"\",'1 Deckblatt St.2024-04-09'!J50)","v":""},{"$f":"IF(C23=\"\",\"\",'5 Fahrgeld + s.A.'!I26)","v":""},{"$error":"#N/A"},{"$f":"IF(C23=\"\",\"\",'5 Fahrgeld + s.A.'!J26)","v":0},{"$error":"#N/A"},{"$f":"IF(C23=\"\",\"\",'4 Honorar+TG, Betreuer'!R68)","v":0},{"$error":"#N/A"},{"$f":"IF(C23=\"\",\"\",'4 Honorar+TG, Betreuer'!S68)","v":0},{"$f":"IF(C23=\"\",\"\",IF(F23=\"Delegationsleiter\",2517,VLOOKUP(E23,$S$11:$W$13,5,FALSE)))","v":{"$error":"#N/A"}},{"$f":"IF(C23=\"\",\"\",'5 Fahrgeld + s.A.'!M26)","v":0},{"$f":"'5 Fahrgeld + s.A.'!K26","v":""},0]
[null,14,{"$f":"'4 Honorar+TG, Betreuer'!C69","v":"TTBW"},{"$f":"IF('1 Deckblatt St.2024-04-09'!H51=\"\",\"\",'1 Deckblatt St.2024-04-09'!H51)","v":""},{"$f":"IF(ISNA(VLOOKUP('5 Fahrgeld + s.A.'!T27,'5 Fahrgeld + s.A.'!$V$14:$X$17,3,FALSE)),\"\",VLOOKUP('5 Fahrgeld + s.A.'!T27,'5 Fahrgeld + s.A.'!$V$14:$X$17,3,FALSE))","v":""},{"$f":"IF('1 Deckblatt St.2024-04-09'!J51=\"\",\"\",'1 Deckblatt St.2024-04-09'!J51)","v":""},{"$f":"IF(C24=\"\",\"\",'5 Fahrgeld + s.A.'!I27)","v":""},{"$error":"#N/A"},{"$f":"IF(C24=\"\",\"\",'5 Fahrgeld + s.A.'!J27)","v":0},{"$error":"#N/A"},{"$f":"IF(C24=\"\",\"\",'4 Honorar+TG, Betreuer'!R73)","v":0},{"$error":"#N/A"},{"$f":"IF(C24=\"\",\"\",'4 Honorar+TG, Betreuer'!S73)","v":0},{"$f":"IF(C24=\"\",\"\",IF(F24=\"Delegationsleiter\",2517,VLOOKUP(E24,$S$11:$W$13,5,FALSE)))","v":{"$error":"#N/A"}},{"$f":"IF(C24=\"\",\"\",'5 Fahrgeld + s.A.'!M27)","v":0},{"$f":"'5 Fahrgeld + s.A.'!K27","v":""},0]
[null,15,{"$f":"'4 Honorar+TG, Betreuer'!C74","v":"TTBW"},{"$f":"IF('1 Deckblatt St.2024-04-09'!H52=\"\",\"\",'1 Deckblatt St.2024-04-09'!H52)","v":""},{"$f":"IF(ISNA(VLOOKUP('5 Fahrgeld + s.A.'!T28,'5 Fahrgeld + s.A.'!$V$14:$X$17,3,FALSE)),\"\",VLOOKUP('5 Fahrgeld + s.A.'!T28,'5 Fahrgeld + s.A.'!$V$14:$X$17,3,FALSE))","v":""},{"$f":"IF('1 Deckblatt St.2024-04-09'!J52=\"\",\"\",'1 Deckblatt St.2024-04-09'!J52)","v":""},{"$f":"IF(C25=\"\",\"\",'5 Fahrgeld + s.A.'!I28)","v":""},{"$f":"IF(C25=\"\",\"\",VLOOKUP(E25,$S$11:$W$13,2,FALSE))","v":{"$error":"#N/A"}},{"$f":"IF(C25=\"\",\"\",'5 Fahrgeld + s.A.'!J28)","v":0},{"$f":"IF(C25=\"\",\"\",VLOOKUP(E25,$S$11:$W$13,3,FALSE))","v":{"$error":"#N/A"}},{"$f":"IF(C25=\"\",\"\",'4 Honorar+TG, Betreuer'!R78)","v":0},{"$f":"IF(C25=\"\",\"\",VLOOKUP(E25,$S$11:$W$13,4,FALSE))","v":{"$error":"#N/A"}},{"$f":"IF(C25=\"\",\"\",'4 Honorar+TG, Betreuer'!S77)","v":""},{"$f":"IF(C25=\"\",\"\",IF(F25=\"Delegationsleiter\",2517,VLOOKUP(E25,$S$11:$W$13,5,FALSE)))","v":{"$error":"#N/A"}},{"$f":"IF(C25=\"\",\"\",'5 Fahrgeld + s.A.'!M28)","v":0},{"$f":"'5 Fahrgeld + s.A.'!K28","v":""},0]
[null,16,{"$f":"'4 Honorar+TG, Betreuer'!C79","v":"TTBW"},{"$f":"IF('1 Deckblatt St.2024-04-09'!H53=\"\",\"\",'1 Deckblatt St.2024-04-09'!H53)","v":""},{"$f":"IF(ISNA(VLOOKUP('5 Fahrgeld + s.A.'!T29,'5 Fahrgeld + s.A.'!$V$14:$X$17,3,FALSE)),\"\",VLOOKUP('5 Fahrgeld + s.A.'!T29,'5 Fahrgeld + s.A.'!$V$14:$X$17,3,FALSE))","v":""},{"$f":"IF('1 Deckblatt St.2024-04-09'!J53=\"\",\"\",'1 Deckblatt St.2024-04-09'!J53)","v":""},{"$f":"IF(C26=\"\",\"\",'5 Fahrgeld + s.A.'!I29)","v":""},{"$f":"IF(C26=\"\",\"\",VLOOKUP(E26,$S$11:$W$13,2,FALSE))","v":{"$error":"#N/A"}},{"$f":"IF(C26=\"\",\"\",'5 Fahrgeld + s.A.'!J29)","v":0},{"$f":"IF(C26=\"\",\"\",VLOOKUP(E26,$S$11:$W$13,3,FALSE))","v":{"$error":"#N/A"}},{"$f":"IF(C26=\"\",\"\",'4 Honorar+TG, Betreuer'!R83)","v":0},{"$f":"IF(C26=\"\",\"\",VLOOKUP(E26,$S$11:$W$13,4,FALSE))","v":{"$error":"#N/A"}},{"$f":"IF(C26=\"\",\"\",'4 Honorar+TG, Betreuer'!S83)","v":0},{"$f":"IF(C26=\"\",\"\",IF(F26=\"Delegationsleiter\",2517,VLOOKUP(E26,$S$11:$W$13,5,FALSE)))","v":{"$error":"#N/A"}},{"$f":"IF(C26=\"\",\"\",'5 Fahrgeld + s.A.'!M29)","v":0},{"$f":"'5 Fahrgeld + s.A.'!K29","v":""},{"$f":"IF(C26=\"\",\"\",SUM(G26,I26,K26,M26,O26))","v":0}]
[]
[null,null,"Turnierleitung",null,null,null,{"$f":"'7 Turnierleitung+Schiri'!I87","v":0},null,{"$f":"'7 Turnierleitung+Schiri'!P87","v":0},null,{"$f":"'7 Turnierleitung+Schiri'!D87","v":0},null,0,null,null,null,{"$f":"IF(C28=\"\",\"\",SUM(G28,I28,K28,M28))","v":0}]
[null,null,"Schiedsrichter",null,null,null,{"$f":"'7 Turnierleitung+Schiri'!I88","v":0},null,{"$f":"'7 Turnierleitung+Schiri'!P88","v":0},null,{"$f":"'7 Turnierleitung+Schiri'!D88","v":0},null,0,null,null,null,{"$f":"IF(C29=\"\",\"\",SUM(G29,I29,K29,M29))","v":0}]

{"sheet":"4 Honorar+TG, Betreuer","index":3,"n_rows":97,"n_cols":37,"rows_kept":97,"cut":false,"hidden":false,"merged":[[34,7,34,8],[26,18,26,19],[29,7,29,8],[1,1,1,15],[77,18,77,19],[71,18,71,19],[72,18,72,19],[73,18,73,19],[74,18,74,19],[75,18,75,19],[34,18,34,19],[35,18,35,19],[36,18,36,19],[37,18,37,19],[38,18,38,19],[40,18,40,19],[39,18,39,19],[59,18,59,19],[60,18,60,19],[41,18,41,19],[42,18,42,19],[43,18,43,19],[44,18,44,19],[45,18,45,19],[46,18,46,19],[47,18,47,19],[23,18,23,19],[24,18,24,19],[25,18,25,19],[27,18,27,19],[28,18,28,19],[29,18,29,19],[30,18,30,19],[32,18,32,19],[33,18,33,19],[31,18,31,19],[1,16,1,19],[6,18,9,19],[10,18,10,19],[11,18,11,19],[12,18,12,19],[13,18,13,19],[2,16,2,18],[3,16,3,18],[14,18,14,19],[24,7,24,8],[8,1,9,1],[8,2,9,2],[8,3,9,3],[8,4,9,4],[6,11,8,11],[8,5,8,7],[2,1,2,15],[3,5,3,15],[4,1,4,15],[5,1,5,19],[4,16,4,19],[6,15,9,15],[3,1,3,4],[6,1,7,7],[6,12,6,14],[15,18,15,19],[16,18,16,19],[17,18,17,19],[18,18,18,19],[19,18,19,19],[20,18,20,19],[21,18,21,19],[22,18,22,19],[6,8,8,8],[6,9,8,9],[19,7,19,8],[19,10,19,11],[19,12,19,14],[14,10,14,11],[14,7,14,8],[7,12,8,12],[9,35,9,36],[9,23,9,32],[6,16,9,16],[6,17,9,17],[8,21,9,21],[9,8,9,14],[6,10,8,10],[7,22,9,22],[38,12,38,14],[14,12,14,14],[24,10,24,11],[24,12,24,14],[29,12,29,14],[34,10,34,11],[29,10,29,11],[7,13,8,13],[7,14,8,14],[38,10,38,11],[34,12,34,14],[42,12,42,14],[42,10,42,11],[46,12,46,14],[46,10,46,11],[72,12,72,14],[50,10,50,11],[50,12,50,14],[54,10,54,11],[54,12,54,14],[58,10,58,11],[58,12,58,14],[72,10,72,11],[62,10,62,11],[62,12,62,14],[86,1,86,2],[67,7,67,8],[72,7,72,8],[77,7,77,8],[79,18,79,19],[80,18,80,19],[48,18,48,19],[49,18,49,19],[50,18,50,19],[62,18,62,19],[63,18,63,19],[64,18,64,19],[53,18,53,19],[51,18,51,19],[52,18,52,19],[54,18,54,19],[67,10,67,11],[67,12,67,14],[61,18,61,19],[76,18,76,19],[65,18,65,19],[66,18,66,19],[67,18,67,19],[68,18,68,19],[77,10,77,11],[77,12,77,14],[82,18,82,19],[78,18,78,19],[82,12,82,14],[55,18,55,19],[56,18,56,19],[57,18,57,19],[58,18,58,19],[69,18,69,19],[70,18,70,19],[81,18,81,19],[96,7,96,10],[92,3,92,4],[93,3,93,4],[93,7,93,10],[82,7,82,8],[82,10,82,11],[95,3,95,4],[87,3,87,8],[88,3,88,8],[89,10,89,11],[87,10,87,11],[85,19,85,20],[95,7,95,10],[94,3,94,4],[91,3,91,5],[88,10,88,11],[89,3,89,8],[86,22,86,36],[94,17,94,21],[92,12,92,13],[93,12,93,13],[94,12,94,13],[92,7,92,10],[94,7,94,10],[96,12,96,14],[87,17,87,21],[86,17,86,21],[88,17,88,21],[89,17,89,21],[90,17,90,21],[91,17,91,21],[92,17,92,21],[95,12,95,13],[93,17,93,21]]}
[]
[]
[null,"Tischtennis Baden-Württemberg e.V.",null,null,null,null,null,null,null,null,null,null,null,null,null,null,{"$f":"IF(Kostenstelle=\"\",\"\",Kostenstelle)","v":""}]
[null,"Veranstaltung:",null,null,null,{"$f":"IF(Veranstaltung=\"\",\"\",Veranstaltung)","v":""},null,null,null,null,null,null,null,null,null,null,"Kostenstelle"]
[]
[]
[null,"Honorar und Tagegeld für Betreuer u.a.",null,null,null,null,null,null,"Honorar","Tagegeld","TTBW-Trainer\n(LSV-Regelung)","Trainer + Deli","Abzüge",null,null," Tagegeld- Satz"," Abzüge"," Tagegeld- Betrag"," Honorar\nmax. 75,00 €"]
[null,null,null,null,null,null,null,null,null,null,null,null,"Frühstück","Mittagessen","Abendessen",null,null,null,null,null,null,null,"Kreuz-\nListe\nfür Gült.Prüfung"]
[null,"Nr.","Name, Vorname","Tag","Datum\nTT.MM"," ------------- Reise-  ----------",null,null,null,null,null,null,null,null,null,null,null,null,null,null,null,"Tage\nnur mit Stunden "]
[null,null,null,null,null,"Beginn\nhh:mm","Ende\nhh:mm","Dauer\nhh:mm","(Zutreffendes mit X markieren)",null,null,null,null,null,null,null,null,null,null,null,null,null,null,"TG-Schlüssel",null,null,null,null,null,null,null,null,null,null,null,"TG-Satz"]
[null,"1","LSV","1.",null,null,null,{"$f":"IF(AND(F15=\"\",G15=\"\",NOT(C11=\"\")),IF(G11=\"\",\"24:00\"-F11,G11-F11),\"\")","v":""},null,null,"x",null,null,null,null,{"$f":"IF(AH11=\"X\",\"\",AH11)","v":""},{"$f":"IF(P11=\"\",\"\",(IF(COUNTA(K10:K13)>0,COUNTA(N11:O11)*9.6,COUNTA(N11)*9.6+COUNTA(O11)*9.6))+(COUNTA(M11)*4.8))","v":""},{"$f":"IF(Q11=\"\",\"\",IF(Q11>P11,0,P11-Q11))","v":""},{"$f":"IF(AND(NOT(C11=\"\"),I11=\"x\",COUNTA(L11:L14)>0,K15=\"\",F15=\"\",G15=\"\",H15=\"\"),25,\"\")","v":""},null,null,{"$f":"COUNT(H11:H14)","v":0},"X",{"$f":"IF(J11=\"x\",1,0)","v":0},{"$f":"IF(AND(X11=1,(IF(H11=\"\",0,H11)*24>0)),1,0)","v":0},{"$f":"IF(AND(X11=1,COUNTA(K11:K14)>0,(IF(H11=\"\",0,H11)*24>8)),1,0)","v":0},{"$f":"IF(AND(X11=1,COUNTA(K11:K14)>0,(IF(H11=\"\",0,H11)*24>14)),1,0)","v":0},{"$f":"IF(AND(X11=1,COUNTA(K11:K14)>0,(IF(H11=\"\",0,H11)*24=24)),1,0)","v":0},{"$f":"IF(AND(X11=1,COUNTA(K11:K14)=0,(IF(H11=\"\",0,H11)*24>=5)),5,0)","v":0},{"$f":"IF(AND(X11=1,COUNTA(K11:K14)=0,(IF(H11=\"\",0,H11)*24>=8)),1,0)","v":0},{"$f":"IF(AND(X11=1,COUNTA(K11:K14)=0,(IF(H11=\"\",0,H11)*24=24)),1,0)","v":0},{"$f":"IF(AND(X11=1,COUNTA(K11:K14)=0,NOT(H11=\"\"),V11>1),10,0)","v":0},{"$f":"SUM(Y11:AF11)","v":0},{"$f":"VLOOKUP(AG11,$AJ$11:$AK$22,2)","v":"X"},null,0,"X"]
[null,null,null,"2.",null,null,null,{"$f":"IF(AND(F15=\"\",G15=\"\",NOT(C11=\"\")),IF(AND(G12=\"\",COUNTA(G13:G14)>0),\"24:00\"-F12,IF((G12-F12)=0,\"\",G12-F12)),\"\")","v":""},null,null,null,null,null,null,null,{"$f":"IF(AH12=\"X\",\"\",AH12)","v":""},{"$f":"IF(P12=\"\",\"\",(IF(COUNTA(K11:K14)>0,COUNTA(N12:O12)*9.6,COUNTA(N12)*9.6+COUNTA(O12)*9.6))+(COUNTA(M12)*4.8))","v":""},{"$f":"IF(Q12=\"\",\"\",IF(Q12>P12,0,P12-Q12))","v":""},{"$f":"IF(AND(NOT(C11=\"\"),I12=\"x\",NOT(H12=\"\"),COUNTA(L11:L14)>0,K15=\"\",F15=\"\",G15=\"\",H15=\"\"),25,\"\")","v":""},null,null,null,"x",{"$f":"IF(J12=\"x\",1,0)","v":0},{"$f":"IF(AND(X12=1,(IF(H12=\"\",0,H12)*24>0)),1,0)","v":0},{"$f":"IF(AND(X12=1,COUNTA(K11:K14)>0,(IF(H12=\"\",0,H12)*24>8)),1,0)","v":0},{"$f":"IF(AND(X12=1,COUNTA(K11:K14)>0,(IF(H12=\"\",0,H12)*24>14)),1,0)","v":0},{"$f":"IF(AND(X12=1,COUNTA(K11:K14)>0,(IF(H12=\"\",0,H12)*24=24)),1,0)","v":0},{"$f":"IF(AND(X12=1,COUNTA(K11:K14)=0,(IF(H12=\"\",0,H12)*24>=5)),5,0)","v":0},{"$f":"IF(AND(X12=1,COUNTA(K11:K14)=0,(IF(H12=\"\",0,H12)*24>=8)),1,0)","v":0},{"$f":"IF(AND(X12=1,COUNTA(K11:K14)=0,(IF(H12=\"\",0,H12)*24=24)),1,0)","v":0},{"$f":"IF(AND(X12=1,COUNTA(K11:K14)=0,NOT(H12=\"\"),V11>1),10,0)","v":0},{"$f":"SUM(Y12:AF12)","v":0},{"$f":"VLOOKUP(AG12,$AJ$11:$AK$22,2)","v":"X"},null,1,0]
[null,null,null,"3.",null,null,null,{"$f":"IF(AND(F15=\"\",G15=\"\",NOT(C11=\"\")),IF(AND(G13=\"\",COUNTA(G14)>0),\"24:00\"-F13,IF((G13-F13)=0,\"\",G13-F13)),\"\")","v":""},null,null,null,null,null,null,null,{"$f":"IF(AH13=\"X\",\"\",AH13)","v":""},{"$f":"IF(P13=\"\",\"\",(IF(COUNTA(K11:K14)>0,COUNTA(N13:O13)*9.6,COUNTA(N13)*9.6+COUNTA(O13)*9.6))+(COUNTA(M13)*4.8))","v":""},{"$f":"IF(Q13=\"\",\"\",IF(Q13>P13,0,P13-Q13))","v":""},{"$f":"IF(AND(NOT(C11=\"\"),I13=\"x\",NOT(H13=\"\"),COUNTA(L11:L14)>0,K15=\"\",F15=\"\",G15=\"\",H15=\"\"),25,\"\")","v":""},null,null,null,null,{"$f":"IF(J13=\"x\",1,0)","v":0},{"$f":"IF(AND(X13=1,(IF(H13=\"\",0,H13)*24>0)),1,0)","v":0},{"$f":"IF(AND(X13=1,COUNTA(K11:K14)>0,(IF(H13=\"\",0,H13)*24>8)),1,0)","v":0},{"$f":"IF(AND(X13=1,COUNTA(K11:K14)>0,(IF(H13=\"\",0,H13)*24>14)),1,0)","v":0},{"$f":"IF(AND(X13=1,COUNTA(K11:K14)>0,(IF(H13=\"\",0,H13)*24=24)),1,0)","v":0},{"$f":"IF(AND(X13=1,COUNTA(K11:K14)=0,(IF(H13=\"\",0,H13)*24>=5)),5,0)","v":0},{"$f":"IF(AND(X13=1,COUNTA(K11:K14)=0,(IF(H13=\"\",0,H13)*24>=8)),1,0)","v":0},{"$f":"IF(AND(X13=1,COUNTA(K11:K14)=0,(IF(H13=\"\",0,H13)*24=24)),1,0)","v":0},{"$f":"IF(AND(X13=1,COUNTA(K11:K14)=0,NOT(H13=\"\"),V11>1),10,0)","v":0},{"$f":"SUM(Y13:AF13)","v":0},{"$f":"VLOOKUP(AG13,$AJ$11:$AK$22,2)","v":"X"},null,2,12]
[null,null,null,"4.",null,null,null,{"$f":"IF(AND(F15=\"\",G15=\"\",NOT(C11=\"\")),IF((G14-F14)=0,\"\",G14-F14),\"\")","v":""},null,null,null,null,null,null,null,{"$f":"IF(AH14=\"X\",\"\",AH14)","v":""},{"$f":"IF(P14=\"\",\"\",(IF(COUNTA(K11:K14)>0,COUNTA(N14:O14)*9.6,COUNTA(N14)*9.6+COUNTA(O14)*9.6))+(COUNTA(M14)*4.8))","v":""},{"$f":"IF(Q14=\"\",\"\",IF(Q14>P14,0,P14-Q14))","v":""},{"$f":"IF(AND(NOT(C11=\"\"),I14=\"x\",NOT(H14=\"\"),COUNTA(L11:L14)>0,K15=\"\",F15=\"\",G15=\"\",H15=\"\"),25,\"\")","v":""},null,null,null,null,{"$f":"IF(J14=\"x\",1,0)","v":0},{"$f":"IF(AND(X14=1,(IF(H14=\"\",0,H14)*24>0)),1,0)","v":0},{"$f":"IF(AND(X14=1,COUNTA(K11:K14)>0,(IF(H14=\"\",0,H14)*24>8)),1,0)","v":0},{"$f":"IF(AND(X14=1,COUNTA(K11:K14)>0,(IF(H14=\"\",0,H14)*24>14)),1,0)","v":0},{"$f":"IF(AND(X14=1,COUNTA(K11:K14)>0,(IF(H14=\"\",0,H14)*24=24)),1,0)","v":0},{"$f":"IF(AND(X14=1,COUNTA(K11:K14)=0,(IF(H14=\"\",0,H14)*24>=5)),5,0)","v":0},{"$f":"IF(AND(X14=1,COUNTA(K11:K14)=0,(IF(H14=\"\",0,H14)*24>=8)),1,0)","v":0},{"$f":"IF(AND(X14=1,COUNTA(K11:K14)=0,(IF(H14=\"\",0,H14)*24=24)),1,0)","v":0},{"$f":"IF(AND(X14=1,COUNTA(K11:K14)=0,NOT(H14=\"\"),V11>1),10,0)","v":0},{"$f":"SUM(Y14:AF14)","v":0},{"$f":"VLOOKUP(AG14,$AJ$11:$AK$22,2)","v":"X"},null,3,12]
[null,null,null,null,null,{"$f":"IF(OR(C11=\"\",NOT(F11=\"\")),\"\",\"Zeiten ?\")","v":"Zeiten ?"},{"$f":"IF(OR(C11=\"\",COUNTA(F11:F14)=COUNT(G11:G14)),\"\",\"Zeiten ?\")","v":""},{"$f":"IF(AND(COUNTA(C11)>0,COUNTA(I11:I14)>3),\"max. 3 Tage\",\"\")","v":""},null,null,{"$f":"IF(AND(NOT(C11=\"\"),COUNTA(K11:L14)>0,COUNTA(K11:K14)>0,COUNTA(L11:L14)>0),\"Trainer ?\",\"\")","v":""},null,"Summe",null,null,{"$f":"SUM(P11:P14)","v":0},{"$f":"SUM(Q11:Q14)","v":0},{"$f":"SUM(R11:R14)","v":0},{"$f":"SUM(S11:S14)","v":0},null,null,null,null,null,null,null,null,null,null,null,null,null,null,null,null,4,24]
[null,"2","LSV","1.",null,null,null,{"$f":"IF(AND(F20=\"\",G20=\"\",NOT(C16=\"\")),IF(G16=\"\",\"24:00\"-F16,G16-F16),\"\")","v":""},null,null,"x",null,null,null,null,{"$f":"IF(AH16=\"X\",\"\",AH16)","v":""},{"$f":"IF(P16=\"\",\"\",(IF(COUNTA(K16:K19)>0,COUNTA(N16:O16)*9.6,COUNTA(N16)*9.6+COUNTA(O16)*9.6))+(COUNTA(M16)*4.8))","v":""},{"$f":"IF(Q16=\"\",\"\",IF(Q16>P16,0,P16-Q16))","v":""},{"$f":"IF(AND(NOT(C16=\"\"),I16=\"x\",COUNTA(L16:L19)>0,K20=\"\",F20=\"\",G20=\"\",H20=\"\"),25,\"\")","v":""},null,null,{"$f":"COUNT(H16:H19)","v":0},null,{"$f":"IF(J16=\"x\",1,0)","v":0},{"$f":"IF(AND(X16=1,(IF(H16=\"\",0,H16)*24>0)),1,0)","v":0},{"$f":"IF(AND(X16=1,COUNTA(K16:K19)>0,(IF(H16=\"\",0,H16)*24>8)),1,0)","v":0},{"$f":"IF(AND(X16=1,COUNTA(K16:K19)>0,(IF(H16=\"\",0,H16)*24>14)),1,0)","v":0},{"$f":"IF(AND(X16=1,COUNTA(K16:K19)>0,(IF(H16=\"\",0,H16)*24=24)),1,0)","v":0},{"$f":"IF(AND(X16=1,COUNTA(K16:K19)=0,(IF(H16=\"\",0,H16)*24>=5)),5,0)","v":0},{"$f":"IF(AND(X16=1,COUNTA(K16:K19)=0,(IF(H16=\"\",0,H16)*24>=8)),1,0)","v":0},{"$f":"IF(AND(X16=1,COUNTA(K16:K19)=0,(IF(H16=\"\",0,H16)*24=24)),1,0)","v":0},{"$f":"IF(AND(X16=1,COUNTA(K16:K19)=0,NOT(H16=\"\"),V16>1),10,0)","v":0},{"$f":"SUM(Y16:AF16)","v":0},{"$f":"VLOOKUP(AG16,$AJ$11:$AK$22,2)","v":"X"},null,6,14]
[null,null,null,"2.",null,null,null,{"$f":"IF(AND(F20=\"\",G20=\"\",NOT(C16=\"\")),IF(AND(G17=\"\",COUNTA(G18:G19)>0),\"24:00\"-F17,IF((G17-F17)=0,\"\",G17-F17)),\"\")","v":""},null,null,null,null,null,null,null,{"$f":"IF(AH17=\"X\",\"\",AH17)","v":""},{"$f":"IF(P17=\"\",\"\",(IF(COUNTA(K16:K19)>0,COUNTA(N17:O17)*9.6,COUNTA(N17)*9.6+COUNTA(O17)*9.6))+(COUNTA(M17)*4.8))","v":""},{"$f":"IF(Q17=\"\",\"\",IF(Q17>P17,0,P17-Q17))","v":""},{"$f":"IF(AND(NOT(C16=\"\"),I17=\"x\",NOT(H17=\"\"),COUNTA(L16:L19)>0,K20=\"\",F20=\"\",G20=\"\",H20=\"\"),25,\"\")","v":""},null,null,null,null,{"$f":"IF(J17=\"x\",1,0)","v":0},{"$f":"IF(AND(X17=1,(IF(H17=\"\",0,H17)*24>0)),1,0)","v":0},{"$f":"IF(AND(X17=1,COUNTA(K16:K19)>0,(IF(H17=\"\",0,H17)*24>8)),1,0)","v":0},{"$f":"IF(AND(X17=1,COUNTA(K16:K19)>0,(IF(H17=\"\",0,H17)*24>14)),1,0)","v":0},{"$f":"IF(AND(X17=1,COUNTA(K16:K19)>0,(IF(H17=\"\",0,H17)*24=24)),1,0)","v":0},{"$f":"IF(AND(X17=1,COUNTA(K16:K19)=0,(IF(H17=\"\",0,H17)*24>=5)),5,0)","v":0},{"$f":"IF(AND(X17=1,COUNTA(K16:K19)=0,(IF(H17=\"\",0,H17)*24>=8)),1,0)","v":0},{"$f":"IF(AND(X17=1,COUNTA(K16:K19)=0,(IF(H17=\"\",0,H17)*24=24)),1,0)","v":0},{"$f":"IF(AND(X17=1,COUNTA(K16:K19)=0,NOT(H17=\"\"),V16>1),10,0)","v":0},{"$f":"SUM(Y17:AF17)","v":0},{"$f":"VLOOKUP(AG17,$AJ$11:$AK$22,2)","v":"X"},null,7,20]
[null,null,null,"3.",null,null,null,{"$f":"IF(AND(F20=\"\",G20=\"\",NOT(C16=\"\")),IF(AND(G18=\"\",COUNTA(G19)>0),\"24:00\"-F18,IF((G18-F18)=0,\"\",G18-F18)),\"\")","v":""},null,null,null,null,null,null,null,{"$f":"IF(AH18=\"X\",\"\",AH18)","v":""},{"$f":"IF(P18=\"\",\"\",(IF(COUNTA(K16:K19)>0,COUNTA(N18:O18)*9.6,COUNTA(N18)*9.6+COUNTA(O18)*9.6))+(COUNTA(M18)*4.8))","v":""},{"$f":"IF(Q18=\"\",\"\",IF(Q18>P18,0,P18-Q18))","v":""},{"$f":"IF(AND(NOT(C16=\"\"),I18=\"x\",NOT(H18=\"\"),COUNTA(L16:L19)>0,K20=\"\",F20=\"\",G20=\"\",H20=\"\"),25,\"\")","v":""},null,null,null,null,{"$f":"IF(J18=\"x\",1,0)","v":0},{"$f":"IF(AND(X18=1,(IF(H18=\"\",0,H18)*24>0)),1,0)","v":0},{"$f":"IF(AND(X18=1,COUNTA(K16:K19)>0,(IF(H18=\"\",0,H18)*24>8)),1,0)","v":0},{"$f":"IF(AND(X18=1,COUNTA(K16:K19)>0,(IF(H18=\"\",0,H18)*24>14)),1,0)","v":0},{"$f":"IF(AND(X18=1,COUNTA(K16:K19)>0,(IF(H18=\"\",0,H18)*24=24)),1,0)","v":0},{"$f":"IF(AND(X18=1,COUNTA(K16:K19)=0,(IF(H18=\"\",0,H18)*24>=5)),5,0)","v":0},{"$f":"IF(AND(X18=1,COUNTA(K16:K19)=0,(IF(H18=\"\",0,H18)*24>=8)),1,0)","v":0},{"$f":"IF(AND(X18=1,COUNTA(K16:K19)=0,(IF(H18=\"\",0,H18)*24=24)),1,0)","v":0},{"$f":"IF(AND(X18=1,COUNTA(K16:K19)=0,NOT(H18=\"\"),V16>1),10,0)","v":0},{"$f":"SUM(Y18:AF18)","v":0},{"$f":"VLOOKUP(AG18,$AJ$11:$AK$22,2)","v":"X"},null,8,24]
[null,null,null,"4.",null,null,null,{"$f":"IF(AND(F20=\"\",G20=\"\",NOT(C16=\"\")),IF((G19-F19)=0,\"\",G19-F19),\"\")","v":""},null,null,null,null,null,null,null,{"$f":"IF(AH19=\"X\",\"\",AH19)","v":""},{"$f":"IF(P19=\"\",\"\",(IF(COUNTA(K16:K19)>0,COUNTA(N19:O19)*9.6,COUNTA(N19)*9.6+COUNTA(O19)*9.6))+(COUNTA(M19)*4.8))","v":""},{"$f":"IF(Q19=\"\",\"\",IF(Q19>P19,0,P19-Q19))","v":""},{"$f":"IF(AND(NOT(C16=\"\"),I19=\"x\",NOT(H19=\"\"),COUNTA(L16:L19)>0,K20=\"\",F20=\"\",G20=\"\",H20=\"\"),25,\"\")","v":""},null,null,null,null,{"$f":"IF(J19=\"x\",1,0)","v":0},{"$f":"IF(AND(X19=1,(IF(H19=\"\",0,H19)*24>0)),1,0)","v":0},{"$f":"IF(AND(X19=1,COUNTA(K16:K19)>0,(IF(H19=\"\",0,H19)*24>8)),1,0)","v":0},{"$f":"IF(AND(X19=1,COUNTA(K16:K19)>0,(IF(H19=\"\",0,H19)*24>14)),1,0)","v":0},{"$f":"IF(AND(X19=1,COUNTA(K16:K19)>0,(IF(H19=\"\",0,H19)*24=24)),1,0)","v":0},{"$f":"IF(AND(X19=1,COUNTA(K16:K19)=0,(IF(H19=\"\",0,H19)*24>=5)),5,0)","v":0},{"$f":"IF(AND(X19=1,COUNTA(K16:K19)=0,(IF(H19=\"\",0,H19)*24>=8)),1,0)","v":0},{"$f":"IF(AND(X19=1,COUNTA(K16:K19)=0,(IF(H19=\"\",0,H19)*24=24)),1,0)","v":0},{"$f":"IF(AND(X19=1,COUNTA(K16:K19)=0,NOT(H19=\"\"),V16>1),10,0)","v":0},{"$f":"SUM(Y19:AF19)","v":0},{"$f":"VLOOKUP(AG19,$AJ$11:$AK$22,2)","v":"X"},null,11,0]
[null,null,null,null,null,{"$f":"IF(OR(C16=\"\",NOT(F16=\"\")),\"\",\"Zeiten ?\")","v":"Zeiten ?"},{"$f":"IF(OR(C16=\"\",COUNTA(F16:F19)=COUNT(G16:G19)),\"\",\"Zeiten ?\")","v":""},{"$f":"IF(AND(COUNTA(C16)>0,COUNTA(I16:I19)>3),\"max. 3 Tage\",\"\")","v":""},null,null,{"$f":"IF(AND(NOT(C16=\"\"),COUNTA(K16:L19)>0,COUNTA(K16:K19)>0,COUNTA(L16:L19)>0),\"Trainer ?\",\"\")","v":""},null,"Summe",null,null,{"$f":"SUM(P16:P19)","v":0},{"$f":"SUM(Q16:Q19)","v":0},{"$f":"SUM(R16:R19)","v":0},{"$f":"SUM(S16:S19)","v":0},null,null,null,null,null,null,null,null,null,null,null,null,null,null,null,null,16,14]
[null,"3","LSV","1.",null,null,null,{"$f":"IF(AND(F25=\"\",G25=\"\",NOT(C21=\"\")),IF(G21=\"\",\"24:00\"-F21,G21-F21),\"\")","v":""},null,null,"x",null,null,null,null,{"$f":"IF(AH21=\"X\",\"\",AH21)","v":""},{"$f":"IF(P21=\"\",\"\",(IF(COUNTA(K21:K24)>0,COUNTA(N21:O21)*9.6,COUNTA(N21)*9.6+COUNTA(O21)*9.6))+(COUNTA(M21)*4.8))","v":""},{"$f":"IF(Q21=\"\",\"\",IF(Q21>P21,0,P21-Q21))","v":""},{"$f":"IF(AND(NOT(C21=\"\"),I21=\"x\",COUNTA(L21:L24)>0,K25=\"\",F25=\"\",G25=\"\",H25=\"\"),25,\"\")","v":""},null,null,{"$f":"COUNT(H21:H24)","v":0},null,{"$f":"IF(J21=\"x\",1,0)","v":0},{"$f":"IF(AND(X21=1,(IF(H21=\"\",0,H21)*24>0)),1,0)","v":0},{"$f":"IF(AND(X21=1,COUNTA(K21:K24)>0,(IF(H21=\"\",0,H21)*24>8)),1,0)","v":0},{"$f":"IF(AND(X21=1,COUNTA(K21:K24)>0,(IF(H21=\"\",0,H21)*24>14)),1,0)","v":0},{"$f":"IF(AND(X21=1,COUNTA(K21:K24)>0,(IF(H21=\"\",0,H21)*24=24)),1,0)","v":0},{"$f":"IF(AND(X21=1,COUNTA(K21:K24)=0,(IF(H21=\"\",0,H21)*24>=5)),5,0)","v":0},{"$f":"IF(AND(X21=1,COUNTA(K21:K24)=0,(IF(H21=\"\",0,H21)*24>=8)),1,0)","v":0},{"$f":"IF(AND(X21=1,COUNTA(K21:K24)=0,(IF(H21=\"\",0,H21)*24=24)),1,0)","v":0},{"$f":"IF(AND(X21=1,COUNTA(K21:K24)=0,NOT(H21=\"\"),V21>1),10,0)","v":0},{"$f":"SUM(Y21:AF21)","v":0},{"$f":"VLOOKUP(AG21,$AJ$11:$AK$22,2)","v":"X"},null,17,20]
[null,null,null,"2.",null,null,null,{"$f":"IF(AND(F25=\"\",G25=\"\",NOT(C21=\"\")),IF(AND(G22=\"\",COUNTA(G23:G24)>0),\"24:00\"-F22,IF((G22-F22)=0,\"\",G22-F22)),\"\")","v":""},null,null,null,null,null,null,null,{"$f":"IF(AH22=\"X\",\"\",AH22)","v":""},{"$f":"IF(P22=\"\",\"\",(IF(COUNTA(K21:K24)>0,COUNTA(N22:O22)*9.6,COUNTA(N22)*9.6+COUNTA(O22)*9.6))+(COUNTA(M22)*4.8))","v":""},{"$f":"IF(Q22=\"\",\"\",IF(Q22>P22,0,P22-Q22))","v":""},{"$f":"IF(AND(NOT(C21=\"\"),I22=\"x\",NOT(H22=\"\"),COUNTA(L21:L24)>0,K25=\"\",F25=\"\",G25=\"\",H25=\"\"),25,\"\")","v":""},null,null,null,null,{"$f":"IF(J22=\"x\",1,0)","v":0},{"$f":"IF(AND(X22=1,(IF(H22=\"\",0,H22)*24>0)),1,0)","v":0},{"$f":"IF(AND(X22=1,COUNTA(K21:K24)>0,(IF(H22=\"\",0,H22)*24>8)),1,0)","v":0},{"$f":"IF(AND(X22=1,COUNTA(K21:K24)>0,(IF(H22=\"\",0,H22)*24>14)),1,0)","v":0},{"$f":"IF(AND(X22=1,COUNTA(K21:K24)>0,(IF(H22=\"\",0,H22)*24=24)),1,0)","v":0},{"$f":"IF(AND(X22=1,COUNTA(K21:K24)=0,(IF(H22=\"\",0,H22)*24>=5)),5,0)","v":0},{"$f":"IF(AND(X22=1,COUNTA(K21:K24)=0,(IF(H22=\"\",0,H22)*24>=8)),1,0)","v":0},{"$f":"IF(AND(X22=1,COUNTA(K21:K24)=0,(IF(H22=\"\",0,H22)*24=24)),1,0)","v":0},{"$f":"IF(AND(X22=1,COUNTA(K21:K24)=0,NOT(H22=\"\"),V21>1),10,0)","v":0},{"$f":"SUM(Y22:AF22)","v":0},{"$f":"VLOOKUP(AG22,$AJ$11:$AK$22,2)","v":"X"},null,18,24]
[null,null,null,"3.",null,null,null,{"$f":"IF(AND(F25=\"\",G25=\"\",NOT(C21=\"\")),IF(AND(G23=\"\",COUNTA(G24)>0),\"24:00\"-F23,IF((G23-F23)=0,\"\",G23-F23)),\"\")","v":""},null,null,null,null,null,null,null,{"$f":"IF(AH23=\"X\",\"\",AH23)","v":""},{"$f":"IF(P23=\"\",\"\",(IF(COUNTA(K21:K24)>0,COUNTA(N23:O23)*9.6,COUNTA(N23)*9.6+COUNTA(O23)*9.6))+(COUNTA(M23)*4.8))","v":""},{"$f":"IF(Q23=\"\",\"\",IF(Q23>P23,0,P23-Q23))","v":""},{"$f":"IF(AND(NOT(C21=\"\"),I23=\"x\",NOT(H23=\"\"),COUNTA(L21:L24)>0,K25=\"\",F25=\"\",G25=\"\",H25=\"\"),25,\"\")","v":""},null,null,null,null,{"$f":"IF(J23=\"x\",1,0)","v":0},{"$f":"IF(AND(X23=1,(IF(H23=\"\",0,H23)*24>0)),1,0)","v":0},{"$f":"IF(AND(X23=1,COUNTA(K21:K24)>0,(IF(H23=\"\",0,H23)*24>8)),1,0)","v":0},{"$f":"IF(AND(X23=1,COUNTA(K21:K24)>0,(IF(H23=\"\",0,H23)*24>14)),1,0)","v":0},{"$f":"IF(AND(X23=1,COUNTA(K21:K24)>0,(IF(H23=\"\",0,H23)*24=24)),1,0)","v":0},{"$f":"IF(AND(X23=1,COUNTA(K21:K24)=0,(IF(H23=\"\",0,H23)*24>=5)),5,0)","v":0},{"$f":"IF(AND(X23=1,COUNTA(K21:K24)=0,(IF(H23=\"\",0,H23)*24>=8)),1,0)","v":0},{"$f":"IF(AND(X23=1,COUNTA(K21:K24)=0,(IF(H23=\"\",0,H23)*24=24)),1,0)","v":0},{"$f":"IF(AND(X23=1,COUNTA(K21:K24)=0,NOT(H23=\"\"),V21>1),10,0)","v":0},{"$f":"SUM(Y23:AF23)","v":0},{"$f":"VLOOKUP(AG23,$AJ$11:$AK$22,2)","v":"X"}]
[null,null,null,"4.",null,null,null,{"$f":"IF(AND(F25=\"\",G25=\"\",NOT(C21=\"\")),IF((G24-F24)=0,\"\",G24-F24),\"\")","v":""},null,null,null,null,null,null,null,{"$f":"IF(AH24=\"X\",\"\",AH24)","v":""},{"$f":"IF(P24=\"\",\"\",(IF(COUNTA(K21:K24)>0,COUNTA(N24:O24)*9.6,COUNTA(N24)*9.6+COUNTA(O24)*9.6))+(COUNTA(M24)*4.8))","v":""},{"$f":"IF(Q24=\"\",\"\",IF(Q24>P24,0,P24-Q24))","v":""},{"$f":"IF(AND(NOT(C21=\"\"),I24=\"x\",NOT(H24=\"\"),COUNTA(L21:L24)>0,K25=\"\",F25=\"\",G25=\"\",H25=\"\"),25,\"\")","v":""},null,null,null,null,{"$f":"IF(J24=\"x\",1,0)","v":0},{"$f":"IF(AND(X24=1,(IF(H24=\"\",0,H24)*24>0)),1,0)","v":0},{"$f":"IF(AND(X24=1,COUNTA(K21:K24)>0,(IF(H24=\"\",0,H24)*24>8)),1,0)","v":0},{"$f":"IF(AND(X24=1,COUNTA(K21:K24)>0,(IF(H24=\"\",0,H24)*24>14)),1,0)","v":0},{"$f":"IF(AND(X24=1,COUNTA(K21:K24)>0,(IF(H24=\"\",0,H24)*24=24)),1,0)","v":0},{"$f":"IF(AND(X24=1,COUNTA(K21:K24)=0,(IF(H24=\"\",0,H24)*24>=5)),5,0)","v":0},{"$f":"IF(AND(X24=1,COUNTA(K21:K24)=0,(IF(H24=\"\",0,H24)*24>=8)),1,0)","v":0},{"$f":"IF(AND(X24=1,COUNTA(K21:K24)=0,(IF(H24=\"\",0,H24)*24=24)),1,0)","v":0},{"$f":"IF(AND(X24=1,COUNTA(K21:K24)=0,NOT(H24=\"\"),V21>1),10,0)","v":0},{"$f":"SUM(Y24:AF24)","v":0},{"$f":"VLOOKUP(AG24,$AJ$11:$AK$22,2)","v":"X"}]
[null,null,null,null,null,{"$f":"IF(OR(C21=\"\",NOT(F21=\"\")),\"\",\"Zeiten ?\")","v":"Zeiten ?"},{"$f":"IF(OR(C21=\"\",COUNTA(F21:F24)=COUNT(G21:G24)),\"\",\"Zeiten ?\")","v":""},{"$f":"IF(AND(COUNTA(C21)>0,COUNTA(I21:I24)>3),\"max. 3 Tage\",\"\")","v":""},null,null,{"$f":"IF(AND(NOT(C21=\"\"),COUNTA(K21:L24)>0,COUNTA(K21:K24)>0,COUNTA(L21:L24)>0),\"Trainer ?\",\"\")","v":""},null,"Summe",null,null,{"$f":"SUM(P21:P24)","v":0},{"$f":"SUM(Q21:Q24)","v":0},{"$f":"SUM(R21:R24)","v":0},{"$f":"SUM(S21:S24)","v":0}]
[null,"4","LSV","1.",null,null,null,{"$f":"IF(AND(F30=\"\",G30=\"\",NOT(C26=\"\")),IF(G26=\"\",\"24:00\"-F26,G26-F26),\"\")","v":""},null,null,"x",null,null,null,null,{"$f":"IF(AH26=\"X\",\"\",AH26)","v":""},{"$f":"IF(P26=\"\",\"\",(IF(COUNTA(K26:K29)>0,COUNTA(N26:O26)*9.6,COUNTA(N26)*9.6+COUNTA(O26)*9.6))+(COUNTA(M26)*4.8))","v":""},{"$f":"IF(Q26=\"\",\"\",IF(Q26>P26,0,P26-Q26))","v":""},{"$f":"IF(AND(NOT(C26=\"\"),I26=\"x\",COUNTA(L26:L29)>0,K30=\"\",F30=\"\",G30=\"\",H30=\"\"),25,\"\")","v":""},null,null,{"$f":"COUNT(H26:H29)","v":0},null,{"$f":"IF(J26=\"x\",1,0)","v":0},{"$f":"IF(AND(X26=1,(IF(H26=\"\",0,H26)*24>0)),1,0)","v":0},{"$f":"IF(AND(X26=1,COUNTA(K26:K29)>0,(IF(H26=\"\",0,H26)*24>8)),1,0)","v":0},{"$f":"IF(AND(X26=1,COUNTA(K26:K29)>0,(IF(H26=\"\",0,H26)*24>14)),1,0)","v":0},{"$f":"IF(AND(X26=1,COUNTA(K26:K29)>0,(IF(H26=\"\",0,H26)*24=24)),1,0)","v":0},{"$f":"IF(AND(X26=1,COUNTA(K26:K29)=0,(IF(H26=\"\",0,H26)*24>=5)),5,0)","v":0},{"$f":"IF(AND(X26=1,COUNTA(K26:K29)=0,(IF(H26=\"\",0,H26)*24>=8)),1,0)","v":0},{"$f":"IF(AND(X26=1,COUNTA(K26:K29)=0,(IF(H26=\"\",0,H26)*24=24)),1,0)","v":0},{"$f":"IF(AND(X26=1,COUNTA(K26:K29)=0,NOT(H26=\"\"),V26>1),10,0)","v":0},{"$f":"SUM(Y26:AF26)","v":0},{"$f":"VLOOKUP(AG26,$AJ$11:$AK$22,2)","v":"X"}]
[null,null,null,"2.",null,null,null,{"$f":"IF(AND(F30=\"\",G30=\"\",NOT(C26=\"\")),IF(AND(G27=\"\",COUNTA(G28:G29)>0),\"24:00\"-F27,IF((G27-F27)=0,\"\",G27-F27)),\"\")","v":""},null,null,null,null,null,null,null,{"$f":"IF(AH27=\"X\",\"\",AH27)","v":""},{"$f":"IF(P27=\"\",\"\",(IF(COUNTA(K26:K29)>0,COUNTA(N27:O27)*9.6,COUNTA(N27)*9.6+COUNTA(O27)*9.6))+(COUNTA(M27)*4.8))","v":""},{"$f":"IF(Q27=\"\",\"\",IF(Q27>P27,0,P27-Q27))","v":""},{"$f":"IF(AND(NOT(C26=\"\"),I27=\"x\",NOT(H27=\"\"),COUNTA(L26:L29)>0,K30=\"\",F30=\"\",G30=\"\",H30=\"\"),25,\"\")","v":""},null,null,null,null,{"$f":"IF(J27=\"x\",1,0)","v":0},{"$f":"IF(AND(X27=1,(IF(H27=\"\",0,H27)*24>0)),1,0)","v":0},{"$f":"IF(AND(X27=1,COUNTA(K26:K29)>0,(IF(H27=\"\",0,H27)*24>8)),1,0)","v":0},{"$f":"IF(AND(X27=1,COUNTA(K26:K29)>0,(IF(H27=\"\",0,H27)*24>14)),1,0)","v":0},{"$f":"IF(AND(X27=1,COUNTA(K26:K29)>0,(IF(H27=\"\",0,H27)*24=24)),1,0)","v":0},{"$f":"IF(AND(X27=1,COUNTA(K26:K29)=0,(IF(H27=\"\",0,H27)*24>=5)),5,0)","v":0},{"$f":"IF(AND(X27=1,COUNTA(K26:K29)=0,(IF(H27=\"\",0,H27)*24>=8)),1,0)","v":0},{"$f":"IF(AND(X27=1,COUNTA(K26:K29)=0,(IF(H27=\"\",0,H27)*24=24)),1,0)","v":0},{"$f":"IF(AND(X27=1,COUNTA(K26:K29)=0,NOT(H27=\"\"),V26>1),10,0)","v":0},{"$f":"SUM(Y27:AF27)","v":0},{"$f":"VLOOKUP(AG27,$AJ$11:$AK$22,2)","v":"X"}]
[null,null,null,"3.",null,null,null,{"$f":"IF(AND(F30=\"\",G30=\"\",NOT(C26=\"\")),IF(AND(G28=\"\",COUNTA(G29)>0),\"24:00\"-F28,IF((G28-F28)=0,\"\",G28-F28)),\"\")","v":""},null,null,null,null,null,null,null,{"$f":"IF(AH28=\"X\",\"\",AH28)","v":""},{"$f":"IF(P28=\"\",\"\",(IF(COUNTA(K26:K29)>0,COUNTA(N28:O28)*9.6,COUNTA(N28)*9.6+COUNTA(O28)*9.6))+(COUNTA(M28)*4.8))","v":""},{"$f":"IF(Q28=\"\",\"\",IF(Q28>P28,0,P28-Q28))","v":""},{"$f":"IF(AND(NOT(C26=\"\"),I28=\"x\",NOT(H28=\"\"),COUNTA(L26:L29)>0,K30=\"\",F30=\"\",G30=\"\",H30=\"\"),25,\"\")","v":""},null,null,null,null,{"$f":"IF(J28=\"x\",1,0)","v":0},{"$f":"IF(AND(X28=1,(IF(H28=\"\",0,H28)*24>0)),1,0)","v":0},{"$f":"IF(AND(X28=1,COUNTA(K26:K29)>0,(IF(H28=\"\",0,H28)*24>8)),1,0)","v":0},{"$f":"IF(AND(X28=1,COUNTA(K26:K29)>0,(IF(H28=\"\",0,H28)*24>14)),1,0)","v":0},{"$f":"IF(AND(X28=1,COUNTA(K26:K29)>0,(IF(H28=\"\",0,H28)*24=24)),1,0)","v":0},{"$f":"IF(AND(X28=1,COUNTA(K26:K29)=0,(IF(H28=\"\",0,H28)*24>=5)),5,0)","v":0},{"$f":"IF(AND(X28=1,COUNTA(K26:K29)=0,(IF(H28=\"\",0,H28)*24>=8)),1,0)","v":0},{"$f":"IF(AND(X28=1,COUNTA(K26:K29)=0,(IF(H28=\"\",0,H28)*24=24)),1,0)","v":0},{"$f":"IF(AND(X28=1,COUNTA(K26:K29)=0,NOT(H28=\"\"),V26>1),10,0)","v":0},{"$f":"SUM(Y28:AF28)","v":0},{"$f":"VLOOKUP(AG28,$AJ$11:$AK$22,2)","v":"X"}]
[null,null,null,"4.",null,null,null,{"$f":"IF(AND(F30=\"\",G30=\"\",NOT(C26=\"\")),IF((G29-F29)=0,\"\",G29-F29),\"\")","v":""},null,null,null,null,null,null,null,{"$f":"IF(AH29=\"X\",\"\",AH29)","v":""},{"$f":"IF(P29=\"\",\"\",(IF(COUNTA(K26:K29)>0,COUNTA(N29:O29)*9.6,COUNTA(N29)*9.6+COUNTA(O29)*9.6))+(COUNTA(M29)*4.8))","v":""},{"$f":"IF(Q29=\"\",\"\",IF(Q29>P29,0,P29-Q29))","v":""},{"$f":"IF(AND(NOT(C26=\"\"),I29=\"x\",NOT(H29=\"\"),COUNTA(L26:L29)>0,K30=\"\",F30=\"\",G30=\"\",H30=\"\"),25,\"\")","v":""},null,null,null,null,{"$f":"IF(J29=\"x\",1,0)","v":0},{"$f":"IF(AND(X29=1,(IF(H29=\"\",0,H29)*24>0)),1,0)","v":0},{"$f":"IF(AND(X29=1,COUNTA(K26:K29)>0,(IF(H29=\"\",0,H29)*24>8)),1,0)","v":0},{"$f":"IF(AND(X29=1,COUNTA(K26:K29)>0,(IF(H29=\"\",0,H29)*24>14)),1,0)","v":0},{"$f":"IF(AND(X29=1,COUNTA(K26:K29)>0,(IF(H29=\"\",0,H29)*24=24)),1,0)","v":0},{"$f":"IF(AND(X29=1,COUNTA(K26:K29)=0,(IF(H29=\"\",0,H29)*24>=5)),5,0)","v":0},{"$f":"IF(AND(X29=1,COUNTA(K26:K29)=0,(IF(H29=\"\",0,H29)*24>=8)),1,0)","v":0},{"$f":"IF(AND(X29=1,COUNTA(K26:K29)=0,(IF(H29=\"\",0,H29)*24=24)),1,0)","v":0},{"$f":"IF(AND(X29=1,COUNTA(K26:K29)=0,NOT(H29=\"\"),V26>1),10,0)","v":0},{"$f":"SUM(Y29:AF29)","v":0},{"$f":"VLOOKUP(AG29,$AJ$11:$AK$22,2)","v":"X"}]
[null,null,null,null,null,{"$f":"IF(OR(C26=\"\",NOT(F26=\"\")),\"\",\"Zeiten ?\")","v":"Zeiten ?"},{"$f":"IF(OR(C26=\"\",COUNTA(F26:F29)=COUNT(G26:G29)),\"\",\"Zeiten ?\")","v":""},{"$f":"IF(AND(COUNTA(C26)>0,COUNTA(I26:I29)>3),\"max. 3 Tage\",\"\")","v":""},null,null,{"$f":"IF(AND(NOT(C26=\"\"),COUNTA(K26:L29)>0,COUNTA(K26:K29)>0,COUNTA(L26:L29)>0),\"Trainer ?\",\"\")","v":""},null,"Summe",null,null,{"$f":"SUM(P26:P29)","v":0},{"$f":"SUM(Q26:Q29)","v":0},{"$f":"SUM(R26:R29)","v":0},{"$f":"SUM(S26:S29)","v":0}]
[null,"5","LSV","1.",null,null,null,{"$f":"IF(AND(F35=\"\",G35=\"\",NOT(C31=\"\")),IF(G31=\"\",\"24:00\"-F31,G31-F31),\"\")","v":""},null,null,"x",null,null,null,null,{"$f":"IF(AH31=\"X\",\"\",AH31)","v":""},{"$f":"IF(P31=\"\",\"\",(IF(COUNTA(K31:K34)>0,COUNTA(N31:O31)*9.6,COUNTA(N31)*9.6+COUNTA(O31)*9.6))+(COUNTA(M31)*4.8))","v":""},{"$f":"IF(Q31=\"\",\"\",IF(Q31>P31,0,P31-Q31))","v":""},{"$f":"IF(AND(NOT(C31=\"\"),I31=\"x\",COUNTA(L31:L34)>0,K35=\"\",F35=\"\",G35=\"\",H35=\"\"),25,\"\")","v":""},null,null,{"$f":"COUNT(H31:H34)","v":0},null,{"$f":"IF(J31=\"x\",1,0)","v":0},{"$f":"IF(AND(X31=1,(IF(H31=\"\",0,H31)*24>0)),1,0)","v":0},{"$f":"IF(AND(X31=1,COUNTA(K31:K34)>0,(IF(H31=\"\",0,H31)*24>8)),1,0)","v":0},{"$f":"IF(AND(X31=1,COUNTA(K31:K34)>0,(IF(H31=\"\",0,H31)*24>14)),1,0)","v":0},{"$f":"IF(AND(X31=1,COUNTA(K31:K34)>0,(IF(H31=\"\",0,H31)*24=24)),1,0)","v":0},{"$f":"IF(AND(X31=1,COUNTA(K31:K34)=0,(IF(H31=\"\",0,H31)*24>=5)),5,0)","v":0},{"$f":"IF(AND(X31=1,COUNTA(K31:K34)=0,(IF(H31=\"\",0,H31)*24>=8)),1,0)","v":0},{"$f":"IF(AND(X31=1,COUNTA(K31:K34)=0,(IF(H31=\"\",0,H31)*24=24)),1,0)","v":0},{"$f":"IF(AND(X31=1,COUNTA(K31:K34)=0,NOT(H31=\"\"),V31>1),10,0)","v":0},{"$f":"SUM(Y31:AF31)","v":0},{"$f":"VLOOKUP(AG31,$AJ$11:$AK$22,2)","v":"X"}]
[null,null,null,"2.",null,null,null,{"$f":"IF(AND(F35=\"\",G35=\"\",NOT(C31=\"\")),IF(AND(G32=\"\",COUNTA(G33:G34)>0),\"24:00\"-F32,IF((G32-F32)=0,\"\",G32-F32)),\"\")","v":""},null,null,null,null,null,null,null,{"$f":"IF(AH32=\"X\",\"\",AH32)","v":""},{"$f":"IF(P32=\"\",\"\",(IF(COUNTA(K31:K34)>0,COUNTA(N32:O32)*9.6,COUNTA(N32)*9.6+COUNTA(O32)*9.6))+(COUNTA(M32)*4.8))","v":""},{"$f":"IF(Q32=\"\",\"\",IF(Q32>P32,0,P32-Q32))","v":""},{"$f":"IF(AND(NOT(C31=\"\"),I32=\"x\",NOT(H32=\"\"),COUNTA(L31:L34)>0,K35=\"\",F35=\"\",G35=\"\",H35=\"\"),25,\"\")","v":""},null,null,null,null,{"$f":"IF(J32=\"x\",1,0)","v":0},{"$f":"IF(AND(X32=1,(IF(H32=\"\",0,H32)*24>0)),1,0)","v":0},{"$f":"IF(AND(X32=1,COUNTA(K31:K34)>0,(IF(H32=\"\",0,H32)*24>8)),1,0)","v":0},{"$f":"IF(AND(X32=1,COUNTA(K31:K34)>0,(IF(H32=\"\",0,H32)*24>14)),1,0)","v":0},{"$f":"IF(AND(X32=1,COUNTA(K31:K34)>0,(IF(H32=\"\",0,H32)*24=24)),1,0)","v":0},{"$f":"IF(AND(X32=1,COUNTA(K31:K34)=0,(IF(H32=\"\",0,H32)*24>=5)),5,0)","v":0},{"$f":"IF(AND(X32=1,COUNTA(K31:K34)=0,(IF(H32=\"\",0,H32)*24>=8)),1,0)","v":0},{"$f":"IF(AND(X32=1,COUNTA(K31:K34)=0,(IF(H32=\"\",0,H32)*24=24)),1,0)","v":0},{"$f":"IF(AND(X32=1,COUNTA(K31:K34)=0,NOT(H32=\"\"),V31>1),10,0)","v":0},{"$f":"SUM(Y32:AF32)","v":0},{"$f":"VLOOKUP(AG32,$AJ$11:$AK$22,2)","v":"X"}]
[null,null,null,"3.",null,null,null,{"$f":"IF(AND(F35=\"\",G35=\"\",NOT(C31=\"\")),IF(AND(G33=\"\",COUNTA(G34)>0),\"24:00\"-F33,IF((G33-F33)=0,\"\",G33-F33)),\"\")","v":""},null,null,null,null,null,null,null,{"$f":"IF(AH33=\"X\",\"\",AH33)","v":""},{"$f":"IF(P33=\"\",\"\",(IF(COUNTA(K31:K34)>0,COUNTA(N33:O33)*9.6,COUNTA(N33)*9.6+COUNTA(O33)*9.6))+(COUNTA(M33)*4.8))","v":""},{"$f":"IF(Q33=\"\",\"\",IF(Q33>P33,0,P33-Q33))","v":""},{"$f":"IF(AND(NOT(C31=\"\"),I33=\"x\",NOT(H33=\"\"),COUNTA(L31:L34)>0,K35=\"\",F35=\"\",G35=\"\",H35=\"\"),25,\"\")","v":""},null,null,null,null,{"$f":"IF(J33=\"x\",1,0)","v":0},{"$f":"IF(AND(X33=1,(IF(H33=\"\",0,H33)*24>0)),1,0)","v":0},{"$f":"IF(AND(X33=1,COUNTA(K31:K34)>0,(IF(H33=\"\",0,H33)*24>8)),1,0)","v":0},{"$f":"IF(AND(X33=1,COUNTA(K31:K34)>0,(IF(H33=\"\",0,H33)*24>14)),1,0)","v":0},{"$f":"IF(AND(X33=1,COUNTA(K31:K34)>0,(IF(H33=\"\",0,H33)*24=24)),1,0)","v":0},{"$f":"IF(AND(X33=1,COUNTA(K31:K34)=0,(IF(H33=\"\",0,H33)*24>=5)),5,0)","v":0},{"$f":"IF(AND(X33=1,COUNTA(K31:K34)=0,(IF(H33=\"\",0,H33)*24>=8)),1,0)","v":0},{"$f":"IF(AND(X33=1,COUNTA(K31:K34)=0,(IF(H33=\"\",0,H33)*24=24)),1,0)","v":0},{"$f":"IF(AND(X33=1,COUNTA(K31:K34)=0,NOT(H33=\"\"),V31>1),10,0)","v":0},{"$f":"SUM(Y33:AF33)","v":0},{"$f":"VLOOKUP(AG33,$AJ$11:$AK$22,2)","v":"X"}]
[null,null,null,"4.",null,null,null,{"$f":"IF(AND(F35=\"\",G35=\"\",NOT(C31=\"\")),IF((G34-F34)=0,\"\",G34-F34),\"\")","v":""},null,null,null,null,null,null,null,{"$f":"IF(AH34=\"X\",\"\",AH34)","v":""},{"$f":"IF(P34=\"\",\"\",(IF(COUNTA(K31:K34)>0,COUNTA(N34:O34)*9.6,COUNTA(N34)*9.6+COUNTA(O34)*9.6))+(COUNTA(M34)*4.8))","v":""},{"$f":"IF(Q34=\"\",\"\",IF(Q34>P34,0,P34-Q34))","v":""},{"$f":"IF(AND(NOT(C31=\"\"),I34=\"x\",NOT(H34=\"\"),COUNTA(L31:L34)>0,K35=\"\",F35=\"\",G35=\"\",H35=\"\"),25,\"\")","v":""},null,null,null,null,{"$f":"IF(J34=\"x\",1,0)","v":0},{"$f":"IF(AND(X34=1,(IF(H34=\"\",0,H34)*24>0)),1,0)","v":0},{"$f":"IF(AND(X34=1,COUNTA(K31:K34)>0,(IF(H34=\"\",0,H34)*24>8)),1,0)","v":0},{"$f":"IF(AND(X34=1,COUNTA(K31:K34)>0,(IF(H34=\"\",0,H34)*24>14)),1,0)","v":0},{"$f":"IF(AND(X34=1,COUNTA(K31:K34)>0,(IF(H34=\"\",0,H34)*24=24)),1,0)","v":0},{"$f":"IF(AND(X34=1,COUNTA(K31:K34)=0,(IF(H34=\"\",0,H34)*24>=5)),5,0)","v":0},{"$f":"IF(AND(X34=1,COUNTA(K31:K34)=0,(IF(H34=\"\",0,H34)*24>=8)),1,0)","v":0},{"$f":"IF(AND(X34=1,COUNTA(K31:K34)=0,(IF(H34=\"\",0,H34)*24=24)),1,0)","v":0},{"$f":"IF(AND(X34=1,COUNTA(K31:K34)=0,NOT(H34=\"\"),V31>1),10,0)","v":0},{"$f":"SUM(Y34:AF34)","v":0},{"$f":"VLOOKUP(AG34,$AJ$11:$AK$22,2)","v":"X"}]
[null,null,null,null,null,{"$f":"IF(OR(C31=\"\",NOT(F31=\"\")),\"\",\"Zeiten ?\")","v":"Zeiten ?"},{"$f":"IF(OR(C31=\"\",COUNTA(F31:F34)=COUNT(G31:G34)),\"\",\"Zeiten ?\")","v":""},{"$f":"IF(AND(COUNTA(C31)>0,COUNTA(I31:I34)>3),\"max. 3 Tage\",\"\")","v":""},null,null,{"$f":"IF(AND(NOT(C31=\"\"),COUNTA(K31:L34)>0,COUNTA(K31:K34)>0,COUNTA(L31:L34)>0),\"Trainer ?\",\"\")","v":""},null,"Summe",null,null,{"$f":"SUM(P31:P34)","v":0},{"$f":"SUM(Q31:Q34)","v":0},{"$f":"SUM(R31:R34)","v":0},{"$f":"SUM(S31:S34)","v":0}]
[null,"6","LSV","1.",null,null,null,{"$f":"IF(AND(F39=\"\",G39=\"\",NOT(C36=\"\")),IF(G36=\"\",\"24:00\"-F36,G36-F36),\"\")","v":""},null,null,"x",null,null,null,null,{"$f":"IF(AH36=\"X\",\"\",AH36)","v":""},{"$f":"IF(P36=\"\",\"\",(IF(COUNTA(K36:K39)>0,COUNTA(N36:O36)*9.6,COUNTA(N36)*9.6+COUNTA(O36)*9.6))+(COUNTA(M36)*4.8))","v":""},{"$f":"IF(Q36=\"\",\"\",IF(Q36>P36,0,P36-Q36))","v":""},{"$f":"IF(AND(NOT(C36=\"\"),I36=\"x\",NOT(H36=\"\"),COUNTA(L36:L38)>0,K39=\"\",F39=\"\",G39=\"\",H39=\"\"),25,\"\")","v":""},null,null,{"$f":"COUNT(H36:H39)","v":0},null,{"$f":"IF(J36=\"x\",1,0)","v":0},{"$f":"IF(AND(X36=1,(IF(H36=\"\",0,H36)*24>0)),1,0)","v":0},{"$f":"IF(AND(X36=1,COUNTA(K36:K38)>0,(IF(H36=\"\",0,H36)*24>8)),1,0)","v":0},{"$f":"IF(AND(X36=1,COUNTA(K36:K38)>0,(IF(H36=\"\",0,H36)*24>14)),1,0)","v":0},{"$f":"IF(AND(X36=1,COUNTA(K36:K38)>0,(IF(H36=\"\",0,H36)*24=24)),1,0)","v":0},{"$f":"IF(AND(X36=1,COUNTA(K36:K38)=0,(IF(H36=\"\",0,H36)*24>=5)),5,0)","v":0},{"$f":"IF(AND(X36=1,COUNTA(K36:K38)=0,(IF(H36=\"\",0,H36)*24>=8)),1,0)","v":0},{"$f":"IF(AND(X36=1,COUNTA(K36:K38)=0,(IF(H36=\"\",0,H36)*24=24)),1,0)","v":0},{"$f":"IF(AND(X36=1,COUNTA(K36:K38)=0,NOT(H36=\"\"),V36>1),10,0)","v":0},{"$f":"SUM(Y36:AF36)","v":0},{"$f":"VLOOKUP(AG36,$AJ$11:$AK$22,2)","v":"X"}]
[null,null,null,"2.",null,null,null,{"$f":"IF(AND(F39=\"\",G39=\"\",NOT(C36=\"\")),IF(AND(G37=\"\",COUNTA(G38)>0),\"24:00\"-F37,IF((G37-F37)=0,\"\",G37-F37)),\"\")","v":""},null,null,null,null,null,null,null,{"$f":"IF(AH37=\"X\",\"\",AH37)","v":""},{"$f":"IF(P37=\"\",\"\",(IF(COUNTA(K36:K39)>0,COUNTA(N37:O37)*9.6,COUNTA(N37)*9.6+COUNTA(O37)*9.6))+(COUNTA(M37)*4.8))","v":""},{"$f":"IF(Q37=\"\",\"\",IF(Q37>P37,0,P37-Q37))","v":""},{"$f":"IF(AND(NOT(C36=\"\"),I37=\"x\",NOT(H37=\"\"),COUNTA(L36:L38)>0,K39=\"\",F39=\"\",G39=\"\",H39=\"\"),25,\"\")","v":""},null,null,null,null,{"$f":"IF(J37=\"x\",1,0)","v":0},{"$f":"IF(AND(X37=1,(IF(H37=\"\",0,H37)*24>0)),1,0)","v":0},{"$f":"IF(AND(X37=1,COUNTA(K36:K38)>0,(IF(H37=\"\",0,H37)*24>8)),1,0)","v":0},{"$f":"IF(AND(X37=1,COUNTA(K36:K38)>0,(IF(H37=\"\",0,H37)*24>14)),1,0)","v":0},{"$f":"IF(AND(X37=1,COUNTA(K36:K38)>0,(IF(H37=\"\",0,H37)*24=24)),1,0)","v":0},{"$f":"IF(AND(X37=1,COUNTA(K36:K38)=0,(IF(H37=\"\",0,H37)*24>=5)),5,0)","v":0},{"$f":"IF(AND(X37=1,COUNTA(K36:K38)=0,(IF(H37=\"\",0,H37)*24>=8)),1,0)","v":0},{"$f":"IF(AND(X37=1,COUNTA(K36:K38)=0,(IF(H37=\"\",0,H37)*24=24)),1,0)","v":0},{"$f":"IF(AND(X37=1,COUNTA(K36:K38)=0,NOT(H37=\"\"),V36>1),10,0)","v":0},{"$f":"SUM(Y37:AF37)","v":0},{"$f":"VLOOKUP(AG37,$AJ$11:$AK$22,2)","v":"X"}]
[null,null,null,"3.",null,null,null,{"$f":"IF(AND(F39=\"\",G39=\"\",NOT(C36=\"\")),IF((G38-F38)=0,\"\",G38-F38),\"\")","v":""},null,null,null,null,null,null,null,{"$f":"IF(AH38=\"X\",\"\",AH38)","v":""},{"$f":"IF(P38=\"\",\"\",(IF(COUNTA(K36:K39)>0,COUNTA(N38:O38)*9.6,COUNTA(N38)*9.6+COUNTA(O38)*9.6))+(COUNTA(M38)*4.8))","v":""},{"$f":"IF(Q38=\"\",\"\",IF(Q38>P38,0,P38-Q38))","v":""},{"$f":"IF(AND(NOT(C36=\"\"),I38=\"x\",NOT(H38=\"\"),COUNTA(L36:L38)>0,K39=\"\",F39=\"\",G39=\"\",H39=\"\"),25,\"\")","v":""},null,null,null,null,{"$f":"IF(J38=\"x\",1,0)","v":0},{"$f":"IF(AND(X38=1,(IF(H38=\"\",0,H38)*24>0)),1,0)","v":0},{"$f":"IF(AND(X38=1,COUNTA(K36:K38)>0,(IF(H38=\"\",0,H38)*24>8)),1,0)","v":0},{"$f":"IF(AND(X38=1,COUNTA(K36:K38)>0,(IF(H38=\"\",0,H38)*24>14)),1,0)","v":0},{"$f":"IF(AND(X38=1,COUNTA(K36:K38)>0,(IF(H38=\"\",0,H38)*24=24)),1,0)","v":0},{"$f":"IF(AND(X38=1,COUNTA(K36:K38)=0,(IF(H38=\"\",0,H38)*24>=5)),5,0)","v":0},{"$f":"IF(AND(X38=1,COUNTA(K36:K38)=0,(IF(H38=\"\",0,H38)*24>=8)),1,0)","v":0},{"$f":"IF(AND(X38=1,COUNTA(K36:K38)=0,(IF(H38=\"\",0,H38)*24=24)),1,0)","v":0},{"$f":"IF(AND(X38=1,COUNTA(K36:K38)=0,NOT(H38=\"\"),V36>1),10,0)","v":0},{"$f":"SUM(Y38:AF38)","v":0},{"$f":"VLOOKUP(AG38,$AJ$11:$AK$22,2)","v":"X"}]
[null,null,null,null,null,{"$f":"IF(OR(C36=\"\",NOT(F36=\"\")),\"\",\"Zeiten ?\")","v":"Zeiten ?"},{"$f":"IF(OR(C36=\"\",COUNTA(F36:F38)=COUNT(G36:G38)),\"\",\"Zeiten ?\")","v":""},null,null,null,{"$f":"IF(AND(NOT(C36=\"\"),COUNTA(K36:L38)>0,COUNTA(K36:K38)>0,COUNTA(L36:L38)>0),\"Trainer ?\",\"\")","v":""},null,"Summe",null,null,{"$f":"SUM(P36:P38)","v":0},{"$f":"SUM(Q36:Q38)","v":0},{"$f":"SUM(R36:R38)","v":0},{"$f":"SUM(S36:S38)","v":0}]
[null,"7","TTBW","1.",null,null,null,{"$f":"IF(AND(F43=\"\",G43=\"\",NOT(C40=\"\")),IF(G40=\"\",\"24:00\"-F40,G40-F40),\"\")","v":""},null,null,null,"x",null,null,null,{"$f":"IF(AH40=\"X\",\"\",AH40)","v":""},{"$f":"IF(P40=\"\",\"\",(IF(COUNTA(K40:K43)>0,COUNTA(N40:O40)*11.2,COUNTA(N40)*11.2+COUNTA(O40)*11.2))+(COUNTA(M40)*5.6))","v":""},{"$f":"IF(Q40=\"\",\"\",IF(Q40>P40,0,P40-Q40))","v":""},{"$f":"IF(AND(NOT(C40=\"\"),I40=\"x\",NOT(H40=\"\"),COUNTA(L40:L42)>0,K43=\"\",F43=\"\",G43=\"\",H43=\"\"),25,\"\")","v":""},null,null,{"$f":"COUNT(H40:H43)","v":0},null,{"$f":"IF(J40=\"x\",1,0)","v":0},{"$f":"IF(AND(X40=1,(IF(H40=\"\",0,H40)*24>0)),1,0)","v":0},{"$f":"IF(AND(X40=1,COUNTA(K40:K42)>0,(IF(H40=\"\",0,H40)*24>8)),1,0)","v":0},{"$f":"IF(AND(X40=1,COUNTA(K40:K42)>0,(IF(H40=\"\",0,H40)*24>14)),1,0)","v":0},{"$f":"IF(AND(X40=1,COUNTA(K40:K42)>0,(IF(H40=\"\",0,H40)*24=24)),1,0)","v":0},{"$f":"IF(AND(X40=1,COUNTA(K40:K42)=0,(IF(H40=\"\",0,H40)*24>=5)),5,0)","v":0},{"$f":"IF(AND(X40=1,COUNTA(K40:K42)=0,(IF(H40=\"\",0,H40)*24>=8)),1,0)","v":0},{"$f":"IF(AND(X40=1,COUNTA(K40:K42)=0,(IF(H40=\"\",0,H40)*24=24)),1,0)","v":0},{"$f":"IF(AND(X40=1,COUNTA(K40:K42)=0,NOT(H40=\"\"),V40>1),10,0)","v":0},{"$f":"SUM(Y40:AF40)","v":0},{"$f":"VLOOKUP(AG40,$AJ$11:$AK$22,2)","v":"X"}]
[null,null,null,"2.",null,null,null,{"$f":"IF(AND(F43=\"\",G43=\"\",NOT(C40=\"\")),IF(AND(G41=\"\",COUNTA(G42)>0),\"24:00\"-F41,IF((G41-F41)=0,\"\",G41-F41)),\"\")","v":""},null,null,null,null,null,null,null,{"$f":"IF(AH41=\"X\",\"\",AH41)","v":""},{"$f":"IF(P41=\"\",\"\",(IF(COUNTA(K41:K44)>0,COUNTA(N41:O41)*11.2,COUNTA(N41)*11.2+COUNTA(O41)*11.2))+(COUNTA(M41)*5.6))","v":""},{"$f":"IF(Q41=\"\",\"\",IF(Q41>P41,0,P41-Q41))","v":""},{"$f":"IF(AND(NOT(C40=\"\"),I41=\"x\",NOT(H41=\"\"),COUNTA(L40:L42)>0,K43=\"\",F43=\"\",G43=\"\",H43=\"\"),25,\"\")","v":""},null,null,null,null,{"$f":"IF(J41=\"x\",1,0)","v":0},{"$f":"IF(AND(X41=1,(IF(H41=\"\",0,H41)*24>0)),1,0)","v":0},{"$f":"IF(AND(X41=1,COUNTA(K40:K42)>0,(IF(H41=\"\",0,H41)*24>8)),1,0)","v":0},{"$f":"IF(AND(X41=1,COUNTA(K40:K42)>0,(IF(H41=\"\",0,H41)*24>14)),1,0)","v":0},{"$f":"IF(AND(X41=1,COUNTA(K40:K42)>0,(IF(H41=\"\",0,H41)*24=24)),1,0)","v":0},{"$f":"IF(AND(X41=1,COUNTA(K40:K42)=0,(IF(H41=\"\",0,H41)*24>=5)),5,0)","v":0},{"$f":"IF(AND(X41=1,COUNTA(K40:K42)=0,(IF(H41=\"\",0,H41)*24>=8)),1,0)","v":0},{"$f":"IF(AND(X41=1,COUNTA(K40:K42)=0,(IF(H41=\"\",0,H41)*24=24)),1,0)","v":0},{"$f":"IF(AND(X41=1,COUNTA(K40:K42)=0,NOT(H41=\"\"),V40>1),10,0)","v":0},{"$f":"SUM(Y41:AF41)","v":0},{"$f":"VLOOKUP(AG41,$AJ$11:$AK$22,2)","v":"X"}]
[null,null,null,"3.",null,null,null,{"$f":"IF(AND(F43=\"\",G43=\"\",NOT(C40=\"\")),IF((G42-F42)=0,\"\",G42-F42),\"\")","v":""},null,null,null,null,null,null,null,{"$f":"IF(AH42=\"X\",\"\",AH42)","v":""},"",{"$f":"IF(Q42=\"\",\"\",IF(Q42>P42,0,P42-Q42))","v":""},{"$f":"IF(AND(NOT(C40=\"\"),I42=\"x\",NOT(H42=\"\"),COUNTA(L40:L42)>0,K43=\"\",F43=\"\",G43=\"\",H43=\"\"),25,\"\")","v":""},null,null,null,null,{"$f":"IF(J42=\"x\",1,0)","v":0},{"$f":"IF(AND(X42=1,(IF(H42=\"\",0,H42)*24>0)),1,0)","v":0},{"$f":"IF(AND(X42=1,COUNTA(K40:K42)>0,(IF(H42=\"\",0,H42)*24>8)),1,0)","v":0},{"$f":"IF(AND(X42=1,COUNTA(K40:K42)>0,(IF(H42=\"\",0,H42)*24>14)),1,0)","v":0},{"$f":"IF(AND(X42=1,COUNTA(K40:K42)>0,(IF(H42=\"\",0,H42)*24=24)),1,0)","v":0},{"$f":"IF(AND(X42=1,COUNTA(K40:K42)=0,(IF(H42=\"\",0,H42)*24>=5)),5,0)","v":0},{"$f":"IF(AND(X42=1,COUNTA(K40:K42)=0,(IF(H42=\"\",0,H42)*24>=8)),1,0)","v":0},{"$f":"IF(AND(X42=1,COUNTA(K40:K42)=0,(IF(H42=\"\",0,H42)*24=24)),1,0)","v":0},{"$f":"IF(AND(X42=1,COUNTA(K40:K42)=0,NOT(H42=\"\"),V40>1),10,0)","v":0},{"$f":"SUM(Y42:AF42)","v":0},{"$f":"VLOOKUP(AG42,$AJ$11:$AK$22,2)","v":"X"}]
[null,null,null,null,null,{"$f":"IF(OR(C40=\"\",NOT(F40=\"\")),\"\",\"Zeiten ?\")","v":"Zeiten ?"},{"$f":"IF(OR(C40=\"\",COUNTA(F40:F42)=COUNT(G40:G42)),\"\",\"Zeiten ?\")","v":""},null,null,null,{"$f":"IF(AND(NOT(C40=\"\"),COUNTA(K40:L42)>0,COUNTA(K40:K42)>0,COUNTA(L40:L42)>0),\"Trainer ?\",\"\")","v":""},null,"Summe",null,null,{"$f":"SUM(P40:P42)","v":0},{"$f":"SUM(Q40:Q42)","v":0},{"$f":"SUM(R40:R42)","v":0},{"$f":"SUM(S40:S42)","v":0}]
[null,"8","TTBW","1.",null,null,null,{"$f":"IF(AND(F47=\"\",G47=\"\",NOT(C44=\"\")),IF(G44=\"\",\"24:00\"-F44,G44-F44),\"\")","v":""},null,null,null,"x",null,null,null,{"$f":"IF(AH44=\"X\",\"\",AH44)","v":""},"",{"$f":"IF(Q44=\"\",\"\",IF(Q44>P44,0,P44-Q44))","v":""},{"$f":"IF(AND(NOT(C44=\"\"),I44=\"x\",NOT(H44=\"\"),COUNTA(L44:L46)>0,K47=\"\",F47=\"\",G47=\"\",H47=\"\"),25,\"\")","v":""},null,null,{"$f":"COUNT(H44:H47)","v":0},null,{"$f":"IF(J44=\"x\",1,0)","v":0},{"$f":"IF(AND(X44=1,(IF(H44=\"\",0,H44)*24>0)),1,0)","v":0},{"$f":"IF(AND(X44=1,COUNTA(K44:K46)>0,(IF(H44=\"\",0,H44)*24>8)),1,0)","v":0},{"$f":"IF(AND(X44=1,COUNTA(K44:K46)>0,(IF(H44=\"\",0,H44)*24>14)),1,0)","v":0},{"$f":"IF(AND(X44=1,COUNTA(K44:K46)>0,(IF(H44=\"\",0,H44)*24=24)),1,0)","v":0},{"$f":"IF(AND(X44=1,COUNTA(K44:K46)=0,(IF(H44=\"\",0,H44)*24>=5)),5,0)","v":0},{"$f":"IF(AND(X44=1,COUNTA(K44:K46)=0,(IF(H44=\"\",0,H44)*24>=8)),1,0)","v":0},{"$f":"IF(AND(X44=1,COUNTA(K44:K46)=0,(IF(H44=\"\",0,H44)*24=24)),1,0)","v":0},{"$f":"IF(AND(X44=1,COUNTA(K44:K46)=0,NOT(H44=\"\"),V44>1),10,0)","v":0},{"$f":"SUM(Y44:AF44)","v":0},{"$f":"VLOOKUP(AG44,$AJ$11:$AK$22,2)","v":"X"}]
[null,null,null,"2.",null,null,null,{"$f":"IF(AND(F47=\"\",G47=\"\",NOT(C44=\"\")),IF(AND(G45=\"\",COUNTA(G46)>0),\"24:00\"-F45,IF((G45-F45)=0,\"\",G45-F45)),\"\")","v":""},null,null,null,null,null,null,null,{"$f":"IF(AH45=\"X\",\"\",AH45)","v":""},"",{"$f":"IF(Q45=\"\",\"\",IF(Q45>P45,0,P45-Q45))","v":""},{"$f":"IF(AND(NOT(C44=\"\"),I45=\"x\",NOT(H45=\"\"),COUNTA(L44:L46)>0,K47=\"\",F47=\"\",G47=\"\",H47=\"\"),25,\"\")","v":""},null,null,null,null,{"$f":"IF(J45=\"x\",1,0)","v":0},{"$f":"IF(AND(X45=1,(IF(H45=\"\",0,H45)*24>0)),1,0)","v":0},{"$f":"IF(AND(X45=1,COUNTA(K44:K46)>0,(IF(H45=\"\",0,H45)*24>8)),1,0)","v":0},{"$f":"IF(AND(X45=1,COUNTA(K44:K46)>0,(IF(H45=\"\",0,H45)*24>14)),1,0)","v":0},{"$f":"IF(AND(X45=1,COUNTA(K44:K46)>0,(IF(H45=\"\",0,H45)*24=24)),1,0)","v":0},{"$f":"IF(AND(X45=1,COUNTA(K44:K46)=0,(IF(H45=\"\",0,H45)*24>=5)),5,0)","v":0},{"$f":"IF(AND(X45=1,COUNTA(K44:K46)=0,(IF(H45=\"\",0,H45)*24>=8)),1,0)","v":0},{"$f":"IF(AND(X45=1,COUNTA(K44:K46)=0,(IF(H45=\"\",0,H45)*24=24)),1,0)","v":0},{"$f":"IF(AND(X45=1,COUNTA(K44:K46)=0,NOT(H45=\"\"),V44>1),10,0)","v":0},{"$f":"SUM(Y45:AF45)","v":0},{"$f":"VLOOKUP(AG45,$AJ$11:$AK$22,2)","v":"X"}]
[null,null,null,"3.",null,null,null,{"$f":"IF(AND(F47=\"\",G47=\"\",NOT(C44=\"\")),IF((G46-F46)=0,\"\",G46-F46),\"\")","v":""},null,null,null,null,null,null,null,{"$f":"IF(AH46=\"X\",\"\",AH46)","v":""},"",{"$f":"IF(Q46=\"\",\"\",IF(Q46>P46,0,P46-Q46))","v":""},{"$f":"IF(AND(NOT(C44=\"\"),I46=\"x\",NOT(H46=\"\"),COUNTA(L44:L46)>0,K47=\"\",F47=\"\",G47=\"\",H47=\"\"),25,\"\")","v":""},null,null,null,null,{"$f":"IF(J46=\"x\",1,0)","v":0},{"$f":"IF(AND(X46=1,(IF(H46=\"\",0,H46)*24>0)),1,0)","v":0},{"$f":"IF(AND(X46=1,COUNTA(K44:K46)>0,(IF(H46=\"\",0,H46)*24>8)),1,0)","v":0},{"$f":"IF(AND(X46=1,COUNTA(K44:K46)>0,(IF(H46=\"\",0,H46)*24>14)),1,0)","v":0},{"$f":"IF(AND(X46=1,COUNTA(K44:K46)>0,(IF(H46=\"\",0,H46)*24=24)),1,0)","v":0},{"$f":"IF(AND(X46=1,COUNTA(K44:K46)=0,(IF(H46=\"\",0,H46)*24>=5)),5,0)","v":0},{"$f":"IF(AND(X46=1,COUNTA(K44:K46)=0,(IF(H46=\"\",0,H46)*24>=8)),1,0)","v":0},{"$f":"IF(AND(X46=1,COUNTA(K44:K46)=0,(IF(H46=\"\",0,H46)*24=24)),1,0)","v":0},{"$f":"IF(AND(X46=1,COUNTA(K44:K46)=0,NOT(H46=\"\"),V44>1),10,0)","v":0},{"$f":"SUM(Y46:AF46)","v":0},{"$f":"VLOOKUP(AG46,$AJ$11:$AK$22,2)","v":"X"}]
[null,null,null,null,null,{"$f":"IF(OR(C44=\"\",NOT(F44=\"\")),\"\",\"Zeiten ?\")","v":"Zeiten ?"},{"$f":"IF(OR(C44=\"\",COUNTA(F44:F46)=COUNT(G44:G46)),\"\",\"Zeiten ?\")","v":""},null,null,null,{"$f":"IF(AND(NOT(C44=\"\"),COUNTA(K44:L46)>0,COUNTA(K44:K46)>0,COUNTA(L44:L46)>0),\"Trainer ?\",\"\")","v":""},null,"Summe",null,null,{"$f":"SUM(P44:P46)","v":0},{"$f":"SUM(Q44:Q46)","v":0},{"$f":"SUM(R44:R46)","v":0},{"$f":"SUM(S44:S46)","v":0}]
[null,"9","TTBW","1.",null,null,null,{"$f":"IF(AND(F51=\"\",G51=\"\",NOT(C48=\"\")),IF(G48=\"\",\"24:00\"-F48,G48-F48),\"\")","v":""},null,null,null,"x",null,null,null,{"$f":"IF(AH48=\"X\",\"\",AH48)","v":""},"",{"$f":"IF(Q48=\"\",\"\",IF(Q48>P48,0,P48-Q48))","v":""},{"$f":"IF(AND(NOT(C48=\"\"),I48=\"x\",NOT(H48=\"\"),COUNTA(L48:L50)>0,K51=\"\",F51=\"\",G51=\"\",H51=\"\"),25,\"\")","v":""},null,null,{"$f":"COUNT(H48:H51)","v":0},null,{"$f":"IF(J48=\"x\",1,0)","v":0},{"$f":"IF(AND(X48=1,(IF(H48=\"\",0,H48)*24>0)),1,0)","v":0},{"$f":"IF(AND(X48=1,COUNTA(K48:K50)>0,(IF(H48=\"\",0,H48)*24>8)),1,0)","v":0},{"$f":"IF(AND(X48=1,COUNTA(K48:K50)>0,(IF(H48=\"\",0,H48)*24>14)),1,0)","v":0},{"$f":"IF(AND(X48=1,COUNTA(K48:K50)>0,(IF(H48=\"\",0,H48)*24=24)),1,0)","v":0},{"$f":"IF(AND(X48=1,COUNTA(K48:K50)=0,(IF(H48=\"\",0,H48)*24>=5)),5,0)","v":0},{"$f":"IF(AND(X48=1,COUNTA(K48:K50)=0,(IF(H48=\"\",0,H48)*24>=8)),1,0)","v":0},{"$f":"IF(AND(X48=1,COUNTA(K48:K50)=0,(IF(H48=\"\",0,H48)*24=24)),1,0)","v":0},{"$f":"IF(AND(X48=1,COUNTA(K48:K50)=0,NOT(H48=\"\"),V48>1),10,0)","v":0},{"$f":"SUM(Y48:AF48)","v":0},{"$f":"VLOOKUP(AG48,$AJ$11:$AK$22,2)","v":"X"}]
[null,null,null,"2.",null,null,null,{"$f":"IF(AND(F51=\"\",G51=\"\",NOT(C48=\"\")),IF(AND(G49=\"\",COUNTA(G50)>0),\"24:00\"-F49,IF((G49-F49)=0,\"\",G49-F49)),\"\")","v":""},null,null,null,null,null,null,null,{"$f":"IF(AH49=\"X\",\"\",AH49)","v":""},"",{"$f":"IF(Q49=\"\",\"\",IF(Q49>P49,0,P49-Q49))","v":""},{"$f":"IF(AND(NOT(C48=\"\"),I49=\"x\",NOT(H49=\"\"),COUNTA(L48:L50)>0,K51=\"\",F51=\"\",G51=\"\",H51=\"\"),25,\"\")","v":""},null,null,null,null,{"$f":"IF(J49=\"x\",1,0)","v":0},{"$f":"IF(AND(X49=1,(IF(H49=\"\",0,H49)*24>0)),1,0)","v":0},{"$f":"IF(AND(X49=1,COUNTA(K48:K50)>0,(IF(H49=\"\",0,H49)*24>8)),1,0)","v":0},{"$f":"IF(AND(X49=1,COUNTA(K48:K50)>0,(IF(H49=\"\",0,H49)*24>14)),1,0)","v":0},{"$f":"IF(AND(X49=1,COUNTA(K48:K50)>0,(IF(H49=\"\",0,H49)*24=24)),1,0)","v":0},{"$f":"IF(AND(X49=1,COUNTA(K48:K50)=0,(IF(H49=\"\",0,H49)*24>=5)),5,0)","v":0},{"$f":"IF(AND(X49=1,COUNTA(K48:K50)=0,(IF(H49=\"\",0,H49)*24>=8)),1,0)","v":0},{"$f":"IF(AND(X49=1,COUNTA(K48:K50)=0,(IF(H49=\"\",0,H49)*24=24)),1,0)","v":0},{"$f":"IF(AND(X49=1,COUNTA(K48:K50)=0,NOT(H49=\"\"),V48>1),10,0)","v":0},{"$f":"SUM(Y49:AF49)","v":0},{"$f":"VLOOKUP(AG49,$AJ$11:$AK$22,2)","v":"X"}]
[null,null,null,"3.",null,null,null,{"$f":"IF(AND(F51=\"\",G51=\"\",NOT(C48=\"\")),IF((G50-F50)=0,\"\",G50-F50),\"\")","v":""},null,null,null,null,null,null,null,{"$f":"IF(AH50=\"X\",\"\",AH50)","v":""},"",{"$f":"IF(Q50=\"\",\"\",IF(Q50>P50,0,P50-Q50))","v":""},{"$f":"IF(AND(NOT(C48=\"\"),I50=\"x\",NOT(H50=\"\"),COUNTA(L48:L50)>0,K51=\"\",F51=\"\",G51=\"\",H51=\"\"),25,\"\")","v":""},null,null,null,null,{"$f":"IF(J50=\"x\",1,0)","v":0},{"$f":"IF(AND(X50=1,(IF(H50=\"\",0,H50)*24>0)),1,0)","v":0},{"$f":"IF(AND(X50=1,COUNTA(K48:K50)>0,(IF(H50=\"\",0,H50)*24>8)),1,0)","v":0},{"$f":"IF(AND(X50=1,COUNTA(K48:K50)>0,(IF(H50=\"\",0,H50)*24>14)),1,0)","v":0},{"$f":"IF(AND(X50=1,COUNTA(K48:K50)>0,(IF(H50=\"\",0,H50)*24=24)),1,0)","v":0},{"$f":"IF(AND(X50=1,COUNTA(K48:K50)=0,(IF(H50=\"\",0,H50)*24>=5)),5,0)","v":0},{"$f":"IF(AND(X50=1,COUNTA(K48:K50)=0,(IF(H50=\"\",0,H50)*24>=8)),1,0)","v":0},{"$f":"IF(AND(X50=1,COUNTA(K48:K50)=0,(IF(H50=\"\",0,H50)*24=24)),1,0)","v":0},{"$f":"IF(AND(X50=1,COUNTA(K48:K50)=0,NOT(H50=\"\"),V48>1),10,0)","v":0},{"$f":"SUM(Y50:AF50)","v":0},{"$f":"VLOOKUP(AG50,$AJ$11:$AK$22,2)","v":"X"}]
[null,null,null,null,null,{"$f":"IF(OR(C48=\"\",NOT(F48=\"\")),\"\",\"Zeiten ?\")","v":"Zeiten ?"},{"$f":"IF(OR(C48=\"\",COUNTA(F48:F50)=COUNT(G48:G50)),\"\",\"Zeiten ?\")","v":""},null,null,null,{"$f":"IF(AND(NOT(C48=\"\"),COUNTA(K48:L50)>0,COUNTA(K48:K50)>0,COUNTA(L48:L50)>0),\"Trainer ?\",\"\")","v":""},null,"Summe",null,null,{"$f":"SUM(P48:P50)","v":0},{"$f":"SUM(Q48:Q50)","v":0},{"$f":"SUM(R48:R50)","v":0},{"$f":"SUM(S48:S50)","v":0}]
[null,"10","TTBW","1.",null,null,null,{"$f":"IF(AND(F55=\"\",G55=\"\",NOT(C52=\"\")),IF(G52=\"\",\"24:00\"-F52,G52-F52),\"\")","v":""},null,null,null,"x",null,null,null,{"$f":"IF(AH52=\"X\",\"\",AH52)","v":""},"",{"$f":"IF(Q52=\"\",\"\",IF(Q52>P52,0,P52-Q52))","v":""},{"$f":"IF(AND(NOT(C52=\"\"),I52=\"x\",NOT(H52=\"\"),COUNTA(L52:L54)>0,K55=\"\",F55=\"\",G55=\"\",H55=\"\"),25,\"\")","v":""},null,null,{"$f":"COUNT(H52:H55)","v":0},null,{"$f":"IF(J52=\"x\",1,0)","v":0},{"$f":"IF(AND(X52=1,(IF(H52=\"\",0,H52)*24>0)),1,0)","v":0},{"$f":"IF(AND(X52=1,COUNTA(K52:K54)>0,(IF(H52=\"\",0,H52)*24>8)),1,0)","v":0},{"$f":"IF(AND(X52=1,COUNTA(K52:K54)>0,(IF(H52=\"\",0,H52)*24>14)),1,0)","v":0},{"$f":"IF(AND(X52=1,COUNTA(K52:K54)>0,(IF(H52=\"\",0,H52)*24=24)),1,0)","v":0},{"$f":"IF(AND(X52=1,COUNTA(K52:K54)=0,(IF(H52=\"\",0,H52)*24>=5)),5,0)","v":0},{"$f":"IF(AND(X52=1,COUNTA(K52:K54)=0,(IF(H52=\"\",0,H52)*24>=8)),1,0)","v":0},{"$f":"IF(AND(X52=1,COUNTA(K52:K54)=0,(IF(H52=\"\",0,H52)*24=24)),1,0)","v":0},{"$f":"IF(AND(X52=1,COUNTA(K52:K54)=0,NOT(H52=\"\"),V52>1),10,0)","v":0},{"$f":"SUM(Y52:AF52)","v":0},{"$f":"VLOOKUP(AG52,$AJ$11:$AK$22,2)","v":"X"}]
[null,null,null,"2.",null,null,null,{"$f":"IF(AND(F55=\"\",G55=\"\",NOT(C52=\"\")),IF(AND(G53=\"\",COUNTA(G54)>0),\"24:00\"-F53,IF((G53-F53)=0,\"\",G53-F53)),\"\")","v":""},null,null,null,null,null,null,null,{"$f":"IF(AH53=\"X\",\"\",AH53)","v":""},"",{"$f":"IF(Q53=\"\",\"\",IF(Q53>P53,0,P53-Q53))","v":""},{"$f":"IF(AND(NOT(C52=\"\"),I53=\"x\",NOT(H53=\"\"),COUNTA(L52:L54)>0,K55=\"\",F55=\"\",G55=\"\",H55=\"\"),25,\"\")","v":""},null,null,null,null,{"$f":"IF(J53=\"x\",1,0)","v":0},{"$f":"IF(AND(X53=1,(IF(H53=\"\",0,H53)*24>0)),1,0)","v":0},{"$f":"IF(AND(X53=1,COUNTA(K52:K54)>0,(IF(H53=\"\",0,H53)*24>8)),1,0)","v":0},{"$f":"IF(AND(X53=1,COUNTA(K52:K54)>0,(IF(H53=\"\",0,H53)*24>14)),1,0)","v":0},{"$f":"IF(AND(X53=1,COUNTA(K52:K54)>0,(IF(H53=\"\",0,H53)*24=24)),1,0)","v":0},{"$f":"IF(AND(X53=1,COUNTA(K52:K54)=0,(IF(H53=\"\",0,H53)*24>=5)),5,0)","v":0},{"$f":"IF(AND(X53=1,COUNTA(K52:K54)=0,(IF(H53=\"\",0,H53)*24>=8)),1,0)","v":0},{"$f":"IF(AND(X53=1,COUNTA(K52:K54)=0,(IF(H53=\"\",0,H53)*24=24)),1,0)","v":0},{"$f":"IF(AND(X53=1,COUNTA(K52:K54)=0,NOT(H53=\"\"),V52>1),10,0)","v":0},{"$f":"SUM(Y53:AF53)","v":0},{"$f":"VLOOKUP(AG53,$AJ$11:$AK$22,2)","v":"X"}]
[null,null,null,"3.",null,null,null,{"$f":"IF(AND(F55=\"\",G55=\"\",NOT(C52=\"\")),IF((G54-F54)=0,\"\",G54-F54),\"\")","v":""},null,null,null,null,null,null,null,{"$f":"IF(AH54=\"X\",\"\",AH54)","v":""},"",{"$f":"IF(Q54=\"\",\"\",IF(Q54>P54,0,P54-Q54))","v":""},{"$f":"IF(AND(NOT(C52=\"\"),I54=\"x\",NOT(H54=\"\"),COUNTA(L52:L54)>0,K55=\"\",F55=\"\",G55=\"\",H55=\"\"),25,\"\")","v":""},null,null,null,null,{"$f":"IF(J54=\"x\",1,0)","v":0},{"$f":"IF(AND(X54=1,(IF(H54=\"\",0,H54)*24>0)),1,0)","v":0},{"$f":"IF(AND(X54=1,COUNTA(K52:K54)>0,(IF(H54=\"\",0,H54)*24>8)),1,0)","v":0},{"$f":"IF(AND(X54=1,COUNTA(K52:K54)>0,(IF(H54=\"\",0,H54)*24>14)),1,0)","v":0},{"$f":"IF(AND(X54=1,COUNTA(K52:K54)>0,(IF(H54=\"\",0,H54)*24=24)),1,0)","v":0},{"$f":"IF(AND(X54=1,COUNTA(K52:K54)=0,(IF(H54=\"\",0,H54)*24>=5)),5,0)","v":0},{"$f":"IF(AND(X54=1,COUNTA(K52:K54)=0,(IF(H54=\"\",0,H54)*24>=8)),1,0)","v":0},{"$f":"IF(AND(X54=1,COUNTA(K52:K54)=0,(IF(H54=\"\",0,H54)*24=24)),1,0)","v":0},{"$f":"IF(AND(X54=1,COUNTA(K52:K54)=0,NOT(H54=\"\"),V52>1),10,0)","v":0},{"$f":"SUM(Y54:AF54)","v":0},{"$f":"VLOOKUP(AG54,$AJ$11:$AK$22,2)","v":"X"}]
[null,null,null,null,null,{"$f":"IF(OR(C52=\"\",NOT(F52=\"\")),\"\",\"Zeiten ?\")","v":"Zeiten ?"},{"$f":"IF(OR(C52=\"\",COUNTA(F52:F54)=COUNT(G52:G54)),\"\",\"Zeiten ?\")","v":""},null,null,null,{"$f":"IF(AND(NOT(C52=\"\"),COUNTA(K52:L54)>0,COUNTA(K52:K54)>0,COUNTA(L52:L54)>0),\"Trainer ?\",\"\")","v":""},null,"Summe",null,null,{"$f":"SUM(P52:P54)","v":0},{"$f":"SUM(Q52:Q54)","v":0},{"$f":"SUM(R52:R54)","v":0},{"$f":"SUM(S52:S54)","v":0}]
[null,"11","TTBW","1.",null,null,null,{"$f":"IF(AND(F59=\"\",G59=\"\",NOT(C56=\"\")),IF(G56=\"\",\"24:00\"-F56,G56-F56),\"\")","v":""},null,null,null,"x",null,null,null,{"$f":"IF(AH56=\"X\",\"\",AH56)","v":""},"",{"$f":"IF(Q56=\"\",\"\",IF(Q56>P56,0,P56-Q56))","v":""},{"$f":"IF(AND(NOT(C56=\"\"),I56=\"x\",NOT(H56=\"\"),COUNTA(L56:L58)>0,K59=\"\",F59=\"\",G59=\"\",H59=\"\"),25,\"\")","v":""},null,null,{"$f":"COUNT(H56:H59)","v":0},null,{"$f":"IF(J56=\"x\",1,0)","v":0},{"$f":"IF(AND(X56=1,(IF(H56=\"\",0,H56)*24>0)),1,0)","v":0},{"$f":"IF(AND(X56=1,COUNTA(K56:K58)>0,(IF(H56=\"\",0,H56)*24>8)),1,0)","v":0},{"$f":"IF(AND(X56=1,COUNTA(K56:K58)>0,(IF(H56=\"\",0,H56)*24>14)),1,0)","v":0},{"$f":"IF(AND(X56=1,COUNTA(K56:K58)>0,(IF(H56=\"\",0,H56)*24=24)),1,0)","v":0},{"$f":"IF(AND(X56=1,COUNTA(K56:K58)=0,(IF(H56=\"\",0,H56)*24>=5)),5,0)","v":0},{"$f":"IF(AND(X56=1,COUNTA(K56:K58)=0,(IF(H56=\"\",0,H56)*24>=8)),1,0)","v":0},{"$f":"IF(AND(X56=1,COUNTA(K56:K58)=0,(IF(H56=\"\",0,H56)*24=24)),1,0)","v":0},{"$f":"IF(AND(X56=1,COUNTA(K56:K58)=0,NOT(H56=\"\"),V56>1),10,0)","v":0},{"$f":"SUM(Y56:AF56)","v":0},{"$f":"VLOOKUP(AG56,$AJ$11:$AK$22,2)","v":"X"}]
[null,null,null,"2.",null,null,null,{"$f":"IF(AND(F59=\"\",G59=\"\",NOT(C56=\"\")),IF(AND(G57=\"\",COUNTA(G58)>0),\"24:00\"-F57,IF((G57-F57)=0,\"\",G57-F57)),\"\")","v":""},null,null,null,null,null,null,null,{"$f":"IF(AH57=\"X\",\"\",AH57)","v":""},"",{"$f":"IF(Q57=\"\",\"\",IF(Q57>P57,0,P57-Q57))","v":""},{"$f":"IF(AND(NOT(C56=\"\"),I57=\"x\",NOT(H57=\"\"),COUNTA(L56:L58)>0,K59=\"\",F59=\"\",G59=\"\",H59=\"\"),25,\"\")","v":""},null,null,null,null,{"$f":"IF(J57=\"x\",1,0)","v":0},{"$f":"IF(AND(X57=1,(IF(H57=\"\",0,H57)*24>0)),1,0)","v":0},{"$f":"IF(AND(X57=1,COUNTA(K56:K58)>0,(IF(H57=\"\",0,H57)*24>8)),1,0)","v":0},{"$f":"IF(AND(X57=1,COUNTA(K56:K58)>0,(IF(H57=\"\",0,H57)*24>14)),1,0)","v":0},{"$f":"IF(AND(X57=1,COUNTA(K56:K58)>0,(IF(H57=\"\",0,H57)*24=24)),1,0)","v":0},{"$f":"IF(AND(X57=1,COUNTA(K56:K58)=0,(IF(H57=\"\",0,H57)*24>=5)),5,0)","v":0},{"$f":"IF(AND(X57=1,COUNTA(K56:K58)=0,(IF(H57=\"\",0,H57)*24>=8)),1,0)","v":0},{"$f":"IF(AND(X57=1,COUNTA(K56:K58)=0,(IF(H57=\"\",0,H57)*24=24)),1,0)","v":0},{"$f":"IF(AND(X57=1,COUNTA(K56:K58)=0,NOT(H57=\"\"),V56>1),10,0)","v":0},{"$f":"SUM(Y57:AF57)","v":0},{"$f":"VLOOKUP(AG57,$AJ$11:$AK$22,2)","v":"X"}]
[null,null,null,"3.",null,null,null,{"$f":"IF(AND(F59=\"\",G59=\"\",NOT(C56=\"\")),IF((G58-F58)=0,\"\",G58-F58),\"\")","v":""},null,null,null,null,null,null,null,{"$f":"IF(AH58=\"X\",\"\",AH58)","v":""},"",{"$f":"IF(Q58=\"\",\"\",IF(Q58>P58,0,P58-Q58))","v":""},{"$f":"IF(AND(NOT(C56=\"\"),I58=\"x\",NOT(H58=\"\"),COUNTA(L56:L58)>0,K59=\"\",F59=\"\",G59=\"\",H59=\"\"),25,\"\")","v":""},null,null,null,null,{"$f":"IF(J58=\"x\",1,0)","v":0},{"$f":"IF(AND(X58=1,(IF(H58=\"\",0,H58)*24>0)),1,0)","v":0},{"$f":"IF(AND(X58=1,COUNTA(K56:K58)>0,(IF(H58=\"\",0,H58)*24>8)),1,0)","v":0},{"$f":"IF(AND(X58=1,COUNTA(K56:K58)>0,(IF(H58=\"\",0,H58)*24>14)),1,0)","v":0},{"$f":"IF(AND(X58=1,COUNTA(K56:K58)>0,(IF(H58=\"\",0,H58)*24=24)),1,0)","v":0},{"$f":"IF(AND(X58=1,COUNTA(K56:K58)=0,(IF(H58=\"\",0,H58)*24>=5)),5,0)","v":0},{"$f":"IF(AND(X58=1,COUNTA(K56:K58)=0,(IF(H58=\"\",0,H58)*24>=8)),1,0)","v":0},{"$f":"IF(AND(X58=1,COUNTA(K56:K58)=0,(IF(H58=\"\",0,H58)*24=24)),1,0)","v":0},{"$f":"IF(AND(X58=1,COUNTA(K56:K58)=0,NOT(H58=\"\"),V56>1),10,0)","v":0},{"$f":"SUM(Y58:AF58)","v":0},{"$f":"VLOOKUP(AG58,$AJ$11:$AK$22,2)","v":"X"}]
[null,null,null,null,null,{"$f":"IF(OR(C56=\"\",NOT(F56=\"\")),\"\",\"Zeiten ?\")","v":"Zeiten ?"},{"$f":"IF(OR(C56=\"\",COUNTA(F56:F58)=COUNT(G56:G58)),\"\",\"Zeiten ?\")","v":""},null,null,null,{"$f":"IF(AND(NOT(C56=\"\"),COUNTA(K56:L58)>0,COUNTA(K56:K58)>0,COUNTA(L56:L58)>0),\"Trainer ?\",\"\")","v":""},null,"Summe",null,null,{"$f":"SUM(P56:P58)","v":0},{"$f":"SUM(Q56:Q58)","v":0},{"$f":"SUM(R56:R58)","v":0},{"$f":"SUM(S56:S58)","v":0}]
[null,"12","TTBW","1.",null,null,null,{"$f":"IF(AND(F63=\"\",G63=\"\",NOT(C60=\"\")),IF(G60=\"\",\"24:00\"-F60,G60-F60),\"\")","v":""},null,null,null,"x",null,null,null,{"$f":"IF(AH60=\"X\",\"\",AH60)","v":""},"",{"$f":"IF(Q60=\"\",\"\",IF(Q60>P60,0,P60-Q60))","v":""},{"$f":"IF(AND(NOT(C60=\"\"),I60=\"x\",NOT(H60=\"\"),COUNTA(L60:L62)>0,K63=\"\",F63=\"\",G63=\"\",H63=\"\"),25,\"\")","v":""},null,null,{"$f":"COUNT(H60:H63)","v":0},null,{"$f":"IF(J60=\"x\",1,0)","v":0},{"$f":"IF(AND(X60=1,(IF(H60=\"\",0,H60)*24>0)),1,0)","v":0},{"$f":"IF(AND(X60=1,COUNTA(K60:K62)>0,(IF(H60=\"\",0,H60)*24>8)),1,0)","v":0},{"$f":"IF(AND(X60=1,COUNTA(K60:K62)>0,(IF(H60=\"\",0,H60)*24>14)),1,0)","v":0},{"$f":"IF(AND(X60=1,COUNTA(K60:K62)>0,(IF(H60=\"\",0,H60)*24=24)),1,0)","v":0},{"$f":"IF(AND(X60=1,COUNTA(K60:K62)=0,(IF(H60=\"\",0,H60)*24>=5)),5,0)","v":0},{"$f":"IF(AND(X60=1,COUNTA(K60:K62)=0,(IF(H60=\"\",0,H60)*24>=8)),1,0)","v":0},{"$f":"IF(AND(X60=1,COUNTA(K60:K62)=0,(IF(H60=\"\",0,H60)*24=24)),1,0)","v":0},{"$f":"IF(AND(X60=1,COUNTA(K60:K62)=0,NOT(H60=\"\"),V60>1),10,0)","v":0},{"$f":"SUM(Y60:AF60)","v":0},{"$f":"VLOOKUP(AG60,$AJ$11:$AK$22,2)","v":"X"}]
[null,null,null,"2.",null,null,null,{"$f":"IF(AND(F63=\"\",G63=\"\",NOT(C60=\"\")),IF(AND(G61=\"\",COUNTA(G62)>0),\"24:00\"-F61,IF((G61-F61)=0,\"\",G61-F61)),\"\")","v":""},null,null,null,null,null,null,null,{"$f":"IF(AH61=\"X\",\"\",AH61)","v":""},"",{"$f":"IF(Q61=\"\",\"\",IF(Q61>P61,0,P61-Q61))","v":""},{"$f":"IF(AND(NOT(C60=\"\"),I61=\"x\",NOT(H61=\"\"),COUNTA(L60:L62)>0,K63=\"\",F63=\"\",G63=\"\",H63=\"\"),25,\"\")","v":""},null,null,null,null,{"$f":"IF(J61=\"x\",1,0)","v":0},{"$f":"IF(AND(X61=1,(IF(H61=\"\",0,H61)*24>0)),1,0)","v":0},{"$f":"IF(AND(X61=1,COUNTA(K60:K62)>0,(IF(H61=\"\",0,H61)*24>8)),1,0)","v":0},{"$f":"IF(AND(X61=1,COUNTA(K60:K62)>0,(IF(H61=\"\",0,H61)*24>14)),1,0)","v":0},{"$f":"IF(AND(X61=1,COUNTA(K60:K62)>0,(IF(H61=\"\",0,H61)*24=24)),1,0)","v":0},{"$f":"IF(AND(X61=1,COUNTA(K60:K62)=0,(IF(H61=\"\",0,H61)*24>=5)),5,0)","v":0},{"$f":"IF(AND(X61=1,COUNTA(K60:K62)=0,(IF(H61=\"\",0,H61)*24>=8)),1,0)","v":0},{"$f":"IF(AND(X61=1,COUNTA(K60:K62)=0,(IF(H61=\"\",0,H61)*24=24)),1,0)","v":0},{"$f":"IF(AND(X61=1,COUNTA(K60:K62)=0,NOT(H61=\"\"),V60>1),10,0)","v":0},{"$f":"SUM(Y61:AF61)","v":0},{"$f":"VLOOKUP(AG61,$AJ$11:$AK$22,2)","v":"X"}]
[null,null,null,"3.",null,null,null,{"$f":"IF(AND(F63=\"\",G63=\"\",NOT(C60=\"\")),IF((G62-F62)=0,\"\",G62-F62),\"\")","v":""},null,null,null,null,null,null,null,{"$f":"IF(AH62=\"X\",\"\",AH62)","v":""},"",{"$f":"IF(Q62=\"\",\"\",IF(Q62>P62,0,P62-Q62))","v":""},{"$f":"IF(AND(NOT(C60=\"\"),I62=\"x\",NOT(H62=\"\"),COUNTA(L60:L62)>0,K63=\"\",F63=\"\",G63=\"\",H63=\"\"),25,\"\")","v":""},null,null,null,null,{"$f":"IF(J62=\"x\",1,0)","v":0},{"$f":"IF(AND(X62=1,(IF(H62=\"\",0,H62)*24>0)),1,0)","v":0},{"$f":"IF(AND(X62=1,COUNTA(K60:K62)>0,(IF(H62=\"\",0,H62)*24>8)),1,0)","v":0},{"$f":"IF(AND(X62=1,COUNTA(K60:K62)>0,(IF(H62=\"\",0,H62)*24>14)),1,0)","v":0},{"$f":"IF(AND(X62=1,COUNTA(K60:K62)>0,(IF(H62=\"\",0,H62)*24=24)),1,0)","v":0},{"$f":"IF(AND(X62=1,COUNTA(K60:K62)=0,(IF(H62=\"\",0,H62)*24>=5)),5,0)","v":0},{"$f":"IF(AND(X62=1,COUNTA(K60:K62)=0,(IF(H62=\"\",0,H62)*24>=8)),1,0)","v":0},{"$f":"IF(AND(X62=1,COUNTA(K60:K62)=0,(IF(H62=\"\",0,H62)*24=24)),1,0)","v":0},{"$f":"IF(AND(X62=1,COUNTA(K60:K62)=0,NOT(H62=\"\"),V60>1),10,0)","v":0},{"$f":"SUM(Y62:AF62)","v":0},{"$f":"VLOOKUP(AG62,$AJ$11:$AK$22,2)","v":"X"}]
[null,null,null,null,null,{"$f":"IF(OR(C60=\"\",NOT(F60=\"\")),\"\",\"Zeiten ?\")","v":"Zeiten ?"},{"$f":"IF(OR(C60=\"\",COUNTA(F60:F62)=COUNT(G60:G62)),\"\",\"Zeiten ?\")","v":""},null,null,null,{"$f":"IF(AND(NOT(C60=\"\"),COUNTA(K60:L62)>0,COUNTA(K60:K62)>0,COUNTA(L60:L62)>0),\"Trainer ?\",\"\")","v":""},null,"Summe",null,null,{"$f":"SUM(P60:P62)","v":0},{"$f":"SUM(Q60:Q62)","v":0},{"$f":"SUM(R60:R62)","v":0},{"$f":"SUM(S60:S62)","v":0}]
[null,"13","TTBW","1.",null,null,null,{"$f":"IF(AND(F68=\"\",G68=\"\",NOT(C64=\"\")),IF(G64=\"\",\"24:00\"-F64,G64-F64),\"\")","v":""},null,null,null,"x",null,null,null,{"$f":"IF(AH64=\"X\",\"\",AH64)","v":""},"",{"$f":"IF(Q64=\"\",\"\",IF(Q64>P64,0,P64-Q64))","v":""},{"$f":"IF(AND(NOT(C64=\"\"),I64=\"x\",K68=\"\",F68=\"\",G68=\"\",H68=\"\"),IF(OR(COUNTA(L64:L67)>0,C93=$D$92),25,\"\"),\"\")","v":""},null,null,{"$f":"COUNT(H64:H67)","v":0},null,{"$f":"IF(J64=\"x\",1,0)","v":0},{"$f":"IF(AND(X64=1,(IF(H64=\"\",0,H64)*24>0)),1,0)","v":0},{"$f":"IF(AND(X64=1,COUNTA(K64:K67)>0,(IF(H64=\"\",0,H64)*24>8)),1,0)","v":0},{"$f":"IF(AND(X64=1,COUNTA(K64:K67)>0,(IF(H64=\"\",0,H64)*24>14)),1,0)","v":0},{"$f":"IF(AND(X64=1,COUNTA(K64:K67)>0,(IF(H64=\"\",0,H64)*24=24)),1,0)","v":0},{"$f":"IF(AND(X64=1,COUNTA(K64:K67)=0,(IF(H64=\"\",0,H64)*24>=5)),5,0)","v":0},{"$f":"IF(AND(X64=1,COUNTA(K64:K67)=0,(IF(H64=\"\",0,H64)*24>=8)),1,0)","v":0},{"$f":"IF(AND(X64=1,COUNTA(K64:K67)=0,(IF(H64=\"\",0,H64)*24=24)),1,0)","v":0},{"$f":"IF(AND(X64=1,COUNTA(K64:K67)=0,NOT(H64=\"\"),V64>1),10,0)","v":0},{"$f":"SUM(Y64:AF64)","v":0},{"$f":"VLOOKUP(AG64,$AJ$11:$AK$22,2)","v":"X"}]
[null,null,null,"2.",null,null,null,{"$f":"IF(AND(F68=\"\",G68=\"\",NOT(C64=\"\")),IF(AND(G65=\"\",COUNTA(G66:G67)>0),\"24:00\"-F65,IF((G65-F65)=0,\"\",G65-F65)),\"\")","v":""},null,null,null,null,null,null,null,{"$f":"IF(AH65=\"X\",\"\",AH65)","v":""},"",{"$f":"IF(Q65=\"\",\"\",IF(Q65>P65,0,P65-Q65))","v":""},{"$f":"IF(AND(NOT(C64=\"\"),I65=\"x\",NOT(H65=\"\"),K68=\"\",F68=\"\",G68=\"\",H68=\"\"),IF(OR(COUNTA(L64:L67)>0,C93=$D$92),25,\"\"),\"\")","v":""},null,null,null,null,{"$f":"IF(J65=\"x\",1,0)","v":0},{"$f":"IF(AND(X65=1,(IF(H65=\"\",0,H65)*24>0)),1,0)","v":0},{"$f":"IF(AND(X65=1,COUNTA(K64:K67)>0,(IF(H65=\"\",0,H65)*24>8)),1,0)","v":0},{"$f":"IF(AND(X65=1,COUNTA(K64:K67)>0,(IF(H65=\"\",0,H65)*24>14)),1,0)","v":0},{"$f":"IF(AND(X65=1,COUNTA(K64:K67)>0,(IF(H65=\"\",0,H65)*24=24)),1,0)","v":0},{"$f":"IF(AND(X65=1,COUNTA(K64:K67)=0,(IF(H65=\"\",0,H65)*24>=5)),5,0)","v":0},{"$f":"IF(AND(X65=1,COUNTA(K64:K67)=0,(IF(H65=\"\",0,H65)*24>=8)),1,0)","v":0},{"$f":"IF(AND(X65=1,COUNTA(K64:K67)=0,(IF(H65=\"\",0,H65)*24=24)),1,0)","v":0},{"$f":"IF(AND(X65=1,COUNTA(K64:K67)=0,NOT(H65=\"\"),V64>1),10,0)","v":0},{"$f":"SUM(Y65:AF65)","v":0},{"$f":"VLOOKUP(AG65,$AJ$11:$AK$22,2)","v":"X"}]
[null,null,null,"3.",null,null,null,{"$f":"IF(AND(F68=\"\",G68=\"\",NOT(C64=\"\")),IF(AND(G66=\"\",COUNTA(G67)>0),\"24:00\"-F66,IF((G66-F66)=0,\"\",G66-F66)),\"\")","v":""},null,null,null,null,null,null,null,{"$f":"IF(AH66=\"X\",\"\",AH66)","v":""},"",{"$f":"IF(Q66=\"\",\"\",IF(Q66>P66,0,P66-Q66))","v":""},{"$f":"IF(AND(NOT(C64=\"\"),I66=\"x\",NOT(H66=\"\"),K68=\"\",F68=\"\",G68=\"\",H68=\"\"),IF(OR(COUNTA(L64:L67)>0,C93=$D$92),25,\"\"),\"\")","v":""},null,null,null,null,{"$f":"IF(J66=\"x\",1,0)","v":0},{"$f":"IF(AND(X66=1,(IF(H66=\"\",0,H66)*24>0)),1,0)","v":0},{"$f":"IF(AND(X66=1,COUNTA(K64:K67)>0,(IF(H66=\"\",0,H66)*24>8)),1,0)","v":0},{"$f":"IF(AND(X66=1,COUNTA(K64:K67)>0,(IF(H66=\"\",0,H66)*24>14)),1,0)","v":0},{"$f":"IF(AND(X66=1,COUNTA(K64:K67)>0,(IF(H66=\"\",0,H66)*24=24)),1,0)","v":0},{"$f":"IF(AND(X66=1,COUNTA(K64:K67)=0,(IF(H66=\"\",0,H66)*24>=5)),5,0)","v":0},{"$f":"IF(AND(X66=1,COUNTA(K64:K67)=0,(IF(H66=\"\",0,H66)*24>=8)),1,0)","v":0},{"$f":"IF(AND(X66=1,COUNTA(K64:K67)=0,(IF(H66=\"\",0,H66)*24=24)),1,0)","v":0},{"$f":"IF(AND(X66=1,COUNTA(K64:K67)=0,NOT(H66=\"\"),V64>1),10,0)","v":0},{"$f":"SUM(Y66:AF66)","v":0},{"$f":"VLOOKUP(AG66,$AJ$11:$AK$22,2)","v":"X"}]
[null,null,null,"4.",null,null,null,{"$f":"IF(AND(F68=\"\",G68=\"\",NOT(C64=\"\")),IF((G67-F67)=0,\"\",G67-F67),\"\")","v":""},null,null,null,null,null,null,null,{"$f":"IF(AH67=\"X\",\"\",AH67)","v":""},"",{"$f":"IF(Q67=\"\",\"\",IF(Q67>P67,0,P67-Q67))","v":""},{"$f":"IF(AND(NOT(C64=\"\"),I67=\"x\",NOT(H67=\"\"),K68=\"\",F68=\"\",G68=\"\",H68=\"\"),IF(OR(COUNTA(L64:L67)>0,C93=$D$92),25,\"\"),\"\")","v":""},null,null,null,null,{"$f":"IF(J67=\"x\",1,0)","v":0},{"$f":"IF(AND(X67=1,(IF(H67=\"\",0,H67)*24>0)),1,0)","v":0},{"$f":"IF(AND(X67=1,COUNTA(K64:K67)>0,(IF(H67=\"\",0,H67)*24>8)),1,0)","v":0},{"$f":"IF(AND(X67=1,COUNTA(K64:K67)>0,(IF(H67=\"\",0,H67)*24>14)),1,0)","v":0},{"$f":"IF(AND(X67=1,COUNTA(K64:K67)>0,(IF(H67=\"\",0,H67)*24=24)),1,0)","v":0},{"$f":"IF(AND(X67=1,COUNTA(K64:K67)=0,(IF(H67=\"\",0,H67)*24>=5)),5,0)","v":0},{"$f":"IF(AND(X67=1,COUNTA(K64:K67)=0,(IF(H67=\"\",0,H67)*24>=8)),1,0)","v":0},{"$f":"IF(AND(X67=1,COUNTA(K64:K67)=0,(IF(H67=\"\",0,H67)*24=24)),1,0)","v":0},{"$f":"IF(AND(X67=1,COUNTA(K64:K67)=0,NOT(H67=\"\"),V64>1),10,0)","v":0},{"$f":"SUM(Y67:AF67)","v":0},{"$f":"VLOOKUP(AG67,$AJ$11:$AK$22,2)","v":"X"}]
[null,null,null,null,null,{"$f":"IF(OR(C64=\"\",NOT(F64=\"\")),\"\",\"Zeiten ?\")","v":"Zeiten ?"},{"$f":"IF(OR(C64=\"\",COUNTA(F64:F67)=COUNT(G64:G67)),\"\",\"Zeiten ?\")","v":""},{"$f":"IF(AND(COUNTA(C64)>0,COUNTA(I64:I67)>3),\"max. 3 Tage\",\"\")","v":""},null,null,{"$f":"IF(AND(NOT(C64=\"\"),COUNTA(K64:L67)>0,COUNTA(K64:K67)>0,COUNTA(L64:L67)>0),\"Trainer ?\",\"\")","v":""},null,"Summe",null,null,{"$f":"SUM(P64:P67)","v":0},{"$f":"SUM(Q64:Q67)","v":0},{"$f":"SUM(R64:R67)","v":0},{"$f":"SUM(S64:S67)","v":0}]
[null,"14","TTBW","1.",null,null,null,{"$f":"IF(AND(F73=\"\",G73=\"\",NOT(C69=\"\")),IF(G69=\"\",\"24:00\"-F69,G69-F69),\"\")","v":""},null,null,null,"x",null,null,null,{"$f":"IF(AH69=\"X\",\"\",AH69)","v":""},"",{"$f":"IF(Q69=\"\",\"\",IF(Q69>P69,0,P69-Q69))","v":""},{"$f":"IF(AND(NOT(C69=\"\"),I69=\"x\",K73=\"\",F73=\"\",G73=\"\",H73=\"\"),IF(OR(COUNTA(L69:L72)>0,C94=$D$92),25,\"\"),\"\")","v":""},null,null,{"$f":"COUNT(H69:H72)","v":0},null,{"$f":"IF(J69=\"x\",1,0)","v":0},{"$f":"IF(AND(X69=1,(IF(H69=\"\",0,H69)*24>0)),1,0)","v":0},{"$f":"IF(AND(X69=1,COUNTA(K69:K72)>0,(IF(H69=\"\",0,H69)*24>8)),1,0)","v":0},{"$f":"IF(AND(X69=1,COUNTA(K69:K72)>0,(IF(H69=\"\",0,H69)*24>14)),1,0)","v":0},{"$f":"IF(AND(X69=1,COUNTA(K69:K72)>0,(IF(H69=\"\",0,H69)*24=24)),1,0)","v":0},{"$f":"IF(AND(X69=1,COUNTA(K69:K72)=0,(IF(H69=\"\",0,H69)*24>=5)),5,0)","v":0},{"$f":"IF(AND(X69=1,COUNTA(K69:K72)=0,(IF(H69=\"\",0,H69)*24>=8)),1,0)","v":0},{"$f":"IF(AND(X69=1,COUNTA(K69:K72)=0,(IF(H69=\"\",0,H69)*24=24)),1,0)","v":0},{"$f":"IF(AND(X69=1,COUNTA(K69:K72)=0,NOT(H69=\"\"),V69>1),10,0)","v":0},{"$f":"SUM(Y69:AF69)","v":0},{"$f":"VLOOKUP(AG69,$AJ$11:$AK$22,2)","v":"X"}]
[null,null,null,"2.",null,null,null,{"$f":"IF(AND(F73=\"\",G73=\"\",NOT(C69=\"\")),IF(AND(G70=\"\",COUNTA(G71:G72)>0),\"24:00\"-F70,IF((G70-F70)=0,\"\",G70-F70)),\"\")","v":""},null,null,null,null,null,null,null,{"$f":"IF(AH70=\"X\",\"\",AH70)","v":""},"",{"$f":"IF(Q70=\"\",\"\",IF(Q70>P70,0,P70-Q70))","v":""},{"$f":"IF(AND(NOT(C69=\"\"),I70=\"x\",NOT(H70=\"\"),K73=\"\",F73=\"\",G73=\"\",H73=\"\"),IF(OR(COUNTA(L69:L72)>0,C94=$D$92),25,\"\"),\"\")","v":""},null,null,null,null,{"$f":"IF(J70=\"x\",1,0)","v":0},{"$f":"IF(AND(X70=1,(IF(H70=\"\",0,H70)*24>0)),1,0)","v":0},{"$f":"IF(AND(X70=1,COUNTA(K69:K72)>0,(IF(H70=\"\",0,H70)*24>8)),1,0)","v":0},{"$f":"IF(AND(X70=1,COUNTA(K69:K72)>0,(IF(H70=\"\",0,H70)*24>14)),1,0)","v":0},{"$f":"IF(AND(X70=1,COUNTA(K69:K72)>0,(IF(H70=\"\",0,H70)*24=24)),1,0)","v":0},{"$f":"IF(AND(X70=1,COUNTA(K69:K72)=0,(IF(H70=\"\",0,H70)*24>=5)),5,0)","v":0},{"$f":"IF(AND(X70=1,COUNTA(K69:K72)=0,(IF(H70=\"\",0,H70)*24>=8)),1,0)","v":0},{"$f":"IF(AND(X70=1,COUNTA(K69:K72)=0,(IF(H70=\"\",0,H70)*24=24)),1,0)","v":0},{"$f":"IF(AND(X70=1,COUNTA(K69:K72)=0,NOT(H70=\"\"),V69>1),10,0)","v":0},{"$f":"SUM(Y70:AF70)","v":0},{"$f":"VLOOKUP(AG70,$AJ$11:$AK$22,2)","v":"X"}]
[null,null,null,"3.",null,null,null,{"$f":"IF(AND(F73=\"\",G73=\"\",NOT(C69=\"\")),IF(AND(G71=\"\",COUNTA(G72)>0),\"24:00\"-F71,IF((G71-F71)=0,\"\",G71-F71)),\"\")","v":""},null,null,null,null,null,null,null,{"$f":"IF(AH71=\"X\",\"\",AH71)","v":""},"",{"$f":"IF(Q71=\"\",\"\",IF(Q71>P71,0,P71-Q71))","v":""},{"$f":"IF(AND(NOT(C69=\"\"),I71=\"x\",NOT(H71=\"\"),K73=\"\",F73=\"\",G73=\"\",H73=\"\"),IF(OR(COUNTA(L69:L72)>0,C94=$D$92),25,\"\"),\"\")","v":""},null,null,null,null,{"$f":"IF(J71=\"x\",1,0)","v":0},{"$f":"IF(AND(X71=1,(IF(H71=\"\",0,H71)*24>0)),1,0)","v":0},{"$f":"IF(AND(X71=1,COUNTA(K69:K72)>0,(IF(H71=\"\",0,H71)*24>8)),1,0)","v":0},{"$f":"IF(AND(X71=1,COUNTA(K69:K72)>0,(IF(H71=\"\",0,H71)*24>14)),1,0)","v":0},{"$f":"IF(AND(X71=1,COUNTA(K69:K72)>0,(IF(H71=\"\",0,H71)*24=24)),1,0)","v":0},{"$f":"IF(AND(X71=1,COUNTA(K69:K72)=0,(IF(H71=\"\",0,H71)*24>=5)),5,0)","v":0},{"$f":"IF(AND(X71=1,COUNTA(K69:K72)=0,(IF(H71=\"\",0,H71)*24>=8)),1,0)","v":0},{"$f":"IF(AND(X71=1,COUNTA(K69:K72)=0,(IF(H71=\"\",0,H71)*24=24)),1,0)","v":0},{"$f":"IF(AND(X71=1,COUNTA(K69:K72)=0,NOT(H71=\"\"),V69>1),10,0)","v":0},{"$f":"SUM(Y71:AF71)","v":0},{"$f":"VLOOKUP(AG71,$AJ$11:$AK$22,2)","v":"X"}]
[null,null,null,"4.",null,null,null,{"$f":"IF(AND(F73=\"\",G73=\"\",NOT(C69=\"\")),IF((G72-F72)=0,\"\",G72-F72),\"\")","v":""},null,null,null,null,null,null,null,{"$f":"IF(AH72=\"X\",\"\",AH72)","v":""},"",{"$f":"IF(Q72=\"\",\"\",IF(Q72>P72,0,P72-Q72))","v":""},{"$f":"IF(AND(NOT(C69=\"\"),I72=\"x\",NOT(H72=\"\"),K73=\"\",F73=\"\",G73=\"\",H73=\"\"),IF(OR(COUNTA(L69:L72)>0,C94=$D$92),25,\"\"),\"\")","v":""},null,null,null,null,{"$f":"IF(J72=\"x\",1,0)","v":0},{"$f":"IF(AND(X72=1,(IF(H72=\"\",0,H72)*24>0)),1,0)","v":0},{"$f":"IF(AND(X72=1,COUNTA(K69:K72)>0,(IF(H72=\"\",0,H72)*24>8)),1,0)","v":0},{"$f":"IF(AND(X72=1,COUNTA(K69:K72)>0,(IF(H72=\"\",0,H72)*24>14)),1,0)","v":0},{"$f":"IF(AND(X72=1,COUNTA(K69:K72)>0,(IF(H72=\"\",0,H72)*24=24)),1,0)","v":0},{"$f":"IF(AND(X72=1,COUNTA(K69:K72)=0,(IF(H72=\"\",0,H72)*24>=5)),5,0)","v":0},{"$f":"IF(AND(X72=1,COUNTA(K69:K72)=0,(IF(H72=\"\",0,H72)*24>=8)),1,0)","v":0},{"$f":"IF(AND(X72=1,COUNTA(K69:K72)=0,(IF(H72=\"\",0,H72)*24=24)),1,0)","v":0},{"$f":"IF(AND(X72=1,COUNTA(K69:K72)=0,NOT(H72=\"\"),V69>1),10,0)","v":0},{"$f":"SUM(Y72:AF72)","v":0},{"$f":"VLOOKUP(AG72,$AJ$11:$AK$22,2)","v":"X"}]
[null,null,null,null,null,{"$f":"IF(OR(C69=\"\",NOT(F69=\"\")),\"\",\"Zeiten ?\")","v":"Zeiten ?"},{"$f":"IF(OR(C69=\"\",COUNTA(F69:F72)=COUNT(G69:G72)),\"\",\"Zeiten ?\")","v":""},{"$f":"IF(AND(COUNTA(C69)>0,COUNTA(I69:I72)>3),\"max. 3 Tage\",\"\")","v":""},null,null,{"$f":"IF(AND(NOT(C69=\"\"),COUNTA(K69:L72)>0,COUNTA(K69:K72)>0,COUNTA(L69:L72)>0),\"Trainer ?\",\"\")","v":""},null,"Summe",null,null,{"$f":"SUM(P69:P72)","v":0},{"$f":"SUM(Q69:Q72)","v":0},{"$f":"SUM(R69:R72)","v":0},{"$f":"SUM(S69:S72)","v":0}]
[null,"15","TTBW","1.",null,null,null,{"$f":"IF(AND(F78=\"\",G78=\"\",NOT(C74=\"\")),IF(G74=\"\",\"24:00\"-F74,G74-F74),\"\")","v":""},null,null,null,"x",null,null,null,{"$f":"IF(AH74=\"X\",\"\",AH74)","v":""},"",{"$f":"IF(Q74=\"\",\"\",IF(Q74>P74,0,P74-Q74))","v":""},{"$f":"IF(AND(NOT(C74=\"\"),I74=\"x\",K78=\"\",F78=\"\",G78=\"\",H78=\"\"),IF(OR(COUNTA(L74:L77)>0,C95=$D$92),25,\"\"),\"\")","v":""},null,null,{"$f":"COUNT(H74:H77)","v":0},null,{"$f":"IF(J74=\"x\",1,0)","v":0},{"$f":"IF(AND(X74=1,(IF(H74=\"\",0,H74)*24>0)),1,0)","v":0},{"$f":"IF(AND(X74=1,COUNTA(K74:K77)>0,(IF(H74=\"\",0,H74)*24>8)),1,0)","v":0},{"$f":"IF(AND(X74=1,COUNTA(K74:K77)>0,(IF(H74=\"\",0,H74)*24>14)),1,0)","v":0},{"$f":"IF(AND(X74=1,COUNTA(K74:K77)>0,(IF(H74=\"\",0,H74)*24=24)),1,0)","v":0},{"$f":"IF(AND(X74=1,COUNTA(K74:K77)=0,(IF(H74=\"\",0,H74)*24>=5)),5,0)","v":0},{"$f":"IF(AND(X74=1,COUNTA(K74:K77)=0,(IF(H74=\"\",0,H74)*24>=8)),1,0)","v":0},{"$f":"IF(AND(X74=1,COUNTA(K74:K77)=0,(IF(H74=\"\",0,H74)*24=24)),1,0)","v":0},{"$f":"IF(AND(X74=1,COUNTA(K74:K77)=0,NOT(H74=\"\"),V74>1),10,0)","v":0},{"$f":"SUM(Y74:AF74)","v":0},{"$f":"VLOOKUP(AG74,$AJ$11:$AK$22,2)","v":"X"}]
[null,null,null,"2.",null,null,null,{"$f":"IF(AND(F78=\"\",G78=\"\",NOT(C74=\"\")),IF(AND(G75=\"\",COUNTA(G76:G77)>0),\"24:00\"-F75,IF((G75-F75)=0,\"\",G75-F75)),\"\")","v":""},null,null,null,null,null,null,null,{"$f":"IF(AH75=\"X\",\"\",AH75)","v":""},"",{"$f":"IF(Q75=\"\",\"\",IF(Q75>P75,0,P75-Q75))","v":""},{"$f":"IF(AND(NOT(C74=\"\"),I75=\"x\",NOT(H75=\"\"),K78=\"\",F78=\"\",G78=\"\",H78=\"\"),IF(OR(COUNTA(L74:L77)>0,C95=$D$92),25,\"\"),\"\")","v":""},null,null,null,null,{"$f":"IF(J75=\"x\",1,0)","v":0},{"$f":"IF(AND(X75=1,(IF(H75=\"\",0,H75)*24>0)),1,0)","v":0},{"$f":"IF(AND(X75=1,COUNTA(K74:K77)>0,(IF(H75=\"\",0,H75)*24>8)),1,0)","v":0},{"$f":"IF(AND(X75=1,COUNTA(K74:K77)>0,(IF(H75=\"\",0,H75)*24>14)),1,0)","v":0},{"$f":"IF(AND(X75=1,COUNTA(K74:K77)>0,(IF(H75=\"\",0,H75)*24=24)),1,0)","v":0},{"$f":"IF(AND(X75=1,COUNTA(K74:K77)=0,(IF(H75=\"\",0,H75)*24>=5)),5,0)","v":0},{"$f":"IF(AND(X75=1,COUNTA(K74:K77)=0,(IF(H75=\"\",0,H75)*24>=8)),1,0)","v":0},{"$f":"IF(AND(X75=1,COUNTA(K74:K77)=0,(IF(H75=\"\",0,H75)*24=24)),1,0)","v":0},{"$f":"IF(AND(X75=1,COUNTA(K74:K77)=0,NOT(H75=\"\"),V74>1),10,0)","v":0},{"$f":"SUM(Y75:AF75)","v":0},{"$f":"VLOOKUP(AG75,$AJ$11:$AK$22,2)","v":"X"}]
[null,null,null,"3.",null,null,null,{"$f":"IF(AND(F78=\"\",G78=\"\",NOT(C74=\"\")),IF(AND(G76=\"\",COUNTA(G77)>0),\"24:00\"-F76,IF((G76-F76)=0,\"\",G76-F76)),\"\")","v":""},null,null,null,null,null,null,null,{"$f":"IF(AH76=\"X\",\"\",AH76)","v":""},"",{"$f":"IF(Q76=\"\",\"\",IF(Q76>P76,0,P76-Q76))","v":""},{"$f":"IF(AND(NOT(C74=\"\"),I76=\"x\",NOT(H76=\"\"),K78=\"\",F78=\"\",G78=\"\",H78=\"\"),IF(OR(COUNTA(L74:L77)>0,C95=$D$92),25,\"\"),\"\")","v":""},null,null,null,null,{"$f":"IF(J76=\"x\",1,0)","v":0},{"$f":"IF(AND(X76=1,(IF(H76=\"\",0,H76)*24>0)),1,0)","v":0},{"$f":"IF(AND(X76=1,COUNTA(K74:K77)>0,(IF(H76=\"\",0,H76)*24>8)),1,0)","v":0},{"$f":"IF(AND(X76=1,COUNTA(K74:K77)>0,(IF(H76=\"\",0,H76)*24>14)),1,0)","v":0},{"$f":"IF(AND(X76=1,COUNTA(K74:K77)>0,(IF(H76=\"\",0,H76)*24=24)),1,0)","v":0},{"$f":"IF(AND(X76=1,COUNTA(K74:K77)=0,(IF(H76=\"\",0,H76)*24>=5)),5,0)","v":0},{"$f":"IF(AND(X76=1,COUNTA(K74:K77)=0,(IF(H76=\"\",0,H76)*24>=8)),1,0)","v":0},{"$f":"IF(AND(X76=1,COUNTA(K74:K77)=0,(IF(H76=\"\",0,H76)*24=24)),1,0)","v":0},{"$f":"IF(AND(X76=1,COUNTA(K74:K77)=0,NOT(H76=\"\"),V74>1),10,0)","v":0},{"$f":"SUM(Y76:AF76)","v":0},{"$f":"VLOOKUP(AG76,$AJ$11:$AK$22,2)","v":"X"}]
[null,null,null,"4.",null,null,null,{"$f":"IF(AND(F78=\"\",G78=\"\",NOT(C74=\"\")),IF((G77-F77)=0,\"\",G77-F77),\"\")","v":""},null,null,null,null,null,null,null,{"$f":"IF(AH77=\"X\",\"\",AH77)","v":""},"",{"$f":"IF(Q77=\"\",\"\",IF(Q77>P77,0,P77-Q77))","v":""},{"$f":"IF(AND(NOT(C74=\"\"),I77=\"x\",NOT(H77=\"\"),K78=\"\",F78=\"\",G78=\"\",H78=\"\"),IF(OR(COUNTA(L74:L77)>0,C95=$D$92),25,\"\"),\"\")","v":""},null,null,null,null,{"$f":"IF(J77=\"x\",1,0)","v":0},{"$f":"IF(AND(X77=1,(IF(H77=\"\",0,H77)*24>0)),1,0)","v":0},{"$f":"IF(AND(X77=1,COUNTA(K74:K77)>0,(IF(H77=\"\",0,H77)*24>8)),1,0)","v":0},{"$f":"IF(AND(X77=1,COUNTA(K74:K77)>0,(IF(H77=\"\",0,H77)*24>14)),1,0)","v":0},{"$f":"IF(AND(X77=1,COUNTA(K74:K77)>0,(IF(H77=\"\",0,H77)*24=24)),1,0)","v":0},{"$f":"IF(AND(X77=1,COUNTA(K74:K77)=0,(IF(H77=\"\",0,H77)*24>=5)),5,0)","v":0},{"$f":"IF(AND(X77=1,COUNTA(K74:K77)=0,(IF(H77=\"\",0,H77)*24>=8)),1,0)","v":0},{"$f":"IF(AND(X77=1,COUNTA(K74:K77)=0,(IF(H77=\"\",0,H77)*24=24)),1,0)","v":0},{"$f":"IF(AND(X77=1,COUNTA(K74:K77)=0,NOT(H77=\"\"),V74>1),10,0)","v":0},{"$f":"SUM(Y77:AF77)","v":0},{"$f":"VLOOKUP(AG77,$AJ$11:$AK$22,2)","v":"X"}]
[null,null,null,null,null,{"$f":"IF(OR(C74=\"\",NOT(F74=\"\")),\"\",\"Zeiten ?\")","v":"Zeiten ?"},{"$f":"IF(OR(C74=\"\",COUNTA(F74:F77)=COUNT(G74:G77)),\"\",\"Zeiten ?\")","v":""},{"$f":"IF(AND(COUNTA(C74)>0,COUNTA(I74:I77)>3),\"max. 3 Tage\",\"\")","v":""},null,null,{"$f":"IF(AND(NOT(C74=\"\"),COUNTA(K74:L77)>0,COUNTA(K74:K77)>0,COUNTA(L74:L77)>0),\"Trainer ?\",\"\")","v":""},null,"Summe",null,null,{"$f":"SUM(P74:P77)","v":0},{"$f":"SUM(Q74:Q77)","v":0},{"$f":"SUM(R74:R77)","v":0},{"$f":"SUM(S74:S77)","v":0}]
[null,"16","TTBW","1.",null,null,null,{"$f":"IF(AND(F83=\"\",G83=\"\",NOT(C79=\"\")),IF(G79=\"\",\"24:00\"-F79,G79-F79),\"\")","v":""},null,null,null,"x",null,null,null,{"$f":"IF(AH79=\"X\",\"\",AH79)","v":""},"",{"$f":"IF(Q79=\"\",\"\",IF(Q79>P79,0,P79-Q79))","v":""},{"$f":"IF(AND(NOT(C79=\"\"),I79=\"x\",K83=\"\",F83=\"\",G83=\"\",H83=\"\"),IF(OR(COUNTA(L79:L82)>0,C96=$D$92),25,\"\"),\"\")","v":""},null,null,{"$f":"COUNT(H79:H82)","v":0},null,{"$f":"IF(J79=\"x\",1,0)","v":0},{"$f":"IF(AND(X79=1,(IF(H79=\"\",0,H79)*24>0)),1,0)","v":0},{"$f":"IF(AND(X79=1,COUNTA(K79:K82)>0,(IF(H79=\"\",0,H79)*24>8)),1,0)","v":0},{"$f":"IF(AND(X79=1,COUNTA(K79:K82)>0,(IF(H79=\"\",0,H79)*24>14)),1,0)","v":0},{"$f":"IF(AND(X79=1,COUNTA(K79:K82)>0,(IF(H79=\"\",0,H79)*24=24)),1,0)","v":0},{"$f":"IF(AND(X79=1,COUNTA(K79:K82)=0,(IF(H79=\"\",0,H79)*24>=5)),5,0)","v":0},{"$f":"IF(AND(X79=1,COUNTA(K79:K82)=0,(IF(H79=\"\",0,H79)*24>=8)),1,0)","v":0},{"$f":"IF(AND(X79=1,COUNTA(K79:K82)=0,(IF(H79=\"\",0,H79)*24=24)),1,0)","v":0},{"$f":"IF(AND(X79=1,COUNTA(K79:K82)=0,NOT(H79=\"\"),V79>1),10,0)","v":0},{"$f":"SUM(Y79:AF79)","v":0},{"$f":"VLOOKUP(AG79,$AJ$11:$AK$22,2)","v":"X"}]
[null,null,null,"2.",null,null,null,{"$f":"IF(AND(F83=\"\",G83=\"\",NOT(C79=\"\")),IF(AND(G80=\"\",COUNTA(G81:G82)>0),\"24:00\"-F80,IF((G80-F80)=0,\"\",G80-F80)),\"\")","v":""},null,null,null,null,null,null,null,{"$f":"IF(AH80=\"X\",\"\",AH80)","v":""},"",{"$f":"IF(Q80=\"\",\"\",IF(Q80>P80,0,P80-Q80))","v":""},{"$f":"IF(AND(NOT(C79=\"\"),I80=\"x\",NOT(H80=\"\"),K83=\"\",F83=\"\",G83=\"\",H83=\"\"),IF(OR(COUNTA(L79:L82)>0,C96=$D$92),25,\"\"),\"\")","v":""},null,null,null,null,{"$f":"IF(J80=\"x\",1,0)","v":0},{"$f":"IF(AND(X80=1,(IF(H80=\"\",0,H80)*24>0)),1,0)","v":0},{"$f":"IF(AND(X80=1,COUNTA(K79:K82)>0,(IF(H80=\"\",0,H80)*24>8)),1,0)","v":0},{"$f":"IF(AND(X80=1,COUNTA(K79:K82)>0,(IF(H80=\"\",0,H80)*24>14)),1,0)","v":0},{"$f":"IF(AND(X80=1,COUNTA(K79:K82)>0,(IF(H80=\"\",0,H80)*24=24)),1,0)","v":0},{"$f":"IF(AND(X80=1,COUNTA(K79:K82)=0,(IF(H80=\"\",0,H80)*24>=5)),5,0)","v":0},{"$f":"IF(AND(X80=1,COUNTA(K79:K82)=0,(IF(H80=\"\",0,H80)*24>=8)),1,0)","v":0},{"$f":"IF(AND(X80=1,COUNTA(K79:K82)=0,(IF(H80=\"\",0,H80)*24=24)),1,0)","v":0},{"$f":"IF(AND(X80=1,COUNTA(K79:K82)=0,NOT(H80=\"\"),V79>1),10,0)","v":0},{"$f":"SUM(Y80:AF80)","v":0},{"$f":"VLOOKUP(AG80,$AJ$11:$AK$22,2)","v":"X"}]
[null,null,null,"3.",null,null,null,{"$f":"IF(AND(F83=\"\",G83=\"\",NOT(C79=\"\")),IF(AND(G81=\"\",COUNTA(G82)>0),\"24:00\"-F81,IF((G81-F81)=0,\"\",G81-F81)),\"\")","v":""},null,null,null,null,null,null,null,{"$f":"IF(AH81=\"X\",\"\",AH81)","v":""},"",{"$f":"IF(Q81=\"\",\"\",IF(Q81>P81,0,P81-Q81))","v":""},{"$f":"IF(AND(NOT(C79=\"\"),I81=\"x\",NOT(H81=\"\"),K83=\"\",F83=\"\",G83=\"\",H83=\"\"),IF(OR(COUNTA(L79:L82)>0,C96=$D$92),25,\"\"),\"\")","v":""},null,null,null,null,{"$f":"IF(J81=\"x\",1,0)","v":0},{"$f":"IF(AND(X81=1,(IF(H81=\"\",0,H81)*24>0)),1,0)","v":0},{"$f":"IF(AND(X81=1,COUNTA(K79:K82)>0,(IF(H81=\"\",0,H81)*24>8)),1,0)","v":0},{"$f":"IF(AND(X81=1,COUNTA(K79:K82)>0,(IF(H81=\"\",0,H81)*24>14)),1,0)","v":0},{"$f":"IF(AND(X81=1,COUNTA(K79:K82)>0,(IF(H81=\"\",0,H81)*24=24)),1,0)","v":0},{"$f":"IF(AND(X81=1,COUNTA(K79:K82)=0,(IF(H81=\"\",0,H81)*24>=5)),5,0)","v":0},{"$f":"IF(AND(X81=1,COUNTA(K79:K82)=0,(IF(H81=\"\",0,H81)*24>=8)),1,0)","v":0},{"$f":"IF(AND(X81=1,COUNTA(K79:K82)=0,(IF(H81=\"\",0,H81)*24=24)),1,0)","v":0},{"$f":"IF(AND(X81=1,COUNTA(K79:K82)=0,NOT(H81=\"\"),V79>1),10,0)","v":0},{"$f":"SUM(Y81:AF81)","v":0},{"$f":"VLOOKUP(AG81,$AJ$11:$AK$22,2)","v":"X"}]
[null,null,null,"4.",null,null,null,{"$f":"IF(AND(F83=\"\",G83=\"\",NOT(C79=\"\")),IF((G82-F82)=0,\"\",G82-F82),\"\")","v":""},null,null,null,null,null,null,null,{"$f":"IF(AH82=\"X\",\"\",AH82)","v":""},"",{"$f":"IF(Q82=\"\",\"\",IF(Q82>P82,0,P82-Q82))","v":""},{"$f":"IF(AND(NOT(C79=\"\"),I82=\"x\",NOT(H82=\"\"),K83=\"\",F83=\"\",G83=\"\",H83=\"\"),IF(OR(COUNTA(L79:L82)>0,C96=$D$92),25,\"\"),\"\")","v":""},null,null,null,null,{"$f":"IF(J82=\"x\",1,0)","v":0},{"$f":"IF(AND(X82=1,(IF(H82=\"\",0,H82)*24>0)),1,0)","v":0},{"$f":"IF(AND(X82=1,COUNTA(K79:K82)>0,(IF(H82=\"\",0,H82)*24>8)),1,0)","v":0},{"$f":"IF(AND(X82=1,COUNTA(K79:K82)>0,(IF(H82=\"\",0,H82)*24>14)),1,0)","v":0},{"$f":"IF(AND(X82=1,COUNTA(K79:K82)>0,(IF(H82=\"\",0,H82)*24=24)),1,0)","v":0},{"$f":"IF(AND(X82=1,COUNTA(K79:K82)=0,(IF(H82=\"\",0,H82)*24>=5)),5,0)","v":0},{"$f":"IF(AND(X82=1,COUNTA(K79:K82)=0,(IF(H82=\"\",0,H82)*24>=8)),1,0)","v":0},{"$f":"IF(AND(X82=1,COUNTA(K79:K82)=0,(IF(H82=\"\",0,H82)*24=24)),1,0)","v":0},{"$f":"IF(AND(X82=1,COUNTA(K79:K82)=0,NOT(H82=\"\"),V79>1),10,0)","v":0},{"$f":"SUM(Y82:AF82)","v":0},{"$f":"VLOOKUP(AG82,$AJ$11:$AK$22,2)","v":"X"}]
[null,null,null,null,null,{"$f":"IF(OR(C79=\"\",NOT(F79=\"\")),\"\",\"Zeiten ?\")","v":"Zeiten ?"},{"$f":"IF(OR(C79=\"\",COUNTA(F79:F82)=COUNT(G79:G82)),\"\",\"Zeiten ?\")","v":""},{"$f":"IF(AND(COUNTA(C79)>0,COUNTA(I79:I82)>3),\"max. 3 Tage\",\"\")","v":""},null,null,{"$f":"IF(AND(NOT(C79=\"\"),COUNTA(K79:L82)>0,COUNTA(K79:K82)>0,COUNTA(L79:L82)>0),\"Trainer ?\",\"\")","v":""},null,"Summe",null,null,{"$f":"SUM(P79:P82)","v":0},{"$f":"SUM(Q79:Q82)","v":0},{"$f":"SUM(R79:R82)","v":0},{"$f":"SUM(S79:S82)","v":0}]
[]
[null,4,26,7,7,8,8,8,3.57,3.57,4,3.57,3.57,3.57,3.57,6.57,6.57,6.57,4.57,2,{"$f":"SUM(B85:T85)","v":119.69999999999993}]
[]
[null,"Summen",null,null,null,null,null,null,null,null,null,null,null,null,null,null,null,"Eingabeliste \"Sonstige\"",null,null,null,null,"Für die Eingabeprüfung im Deckblatt (Namens-Manager)"]
[null,1,"Entgelt: Delegationsleiter","Honorar: 25,00 €/Tag, max. 75,00 €/Veranstaltung",null,null,null,null,null,null,{"$f":"P97","v":0},null,null,null,null,null,null,"Delegationsleiter"]
[null,2,"Entgelt: Betreuer","Honorar: wie (1), nicht hauptamtl. Trainer und Physio.",null,null,null,null,null,null,{"$f":"SUM(S15,S20,S25,S30,S35,S39,S43,S47,S51,S55,S59,S63,S68,S73,S78,-K88)","v":0},null,null,null,null,null,null,"Physiotherapeut"]
[null,4,"Tagegeld","hier nicht Schiedsrichter + Turnierleitung",null,null,null,null,null,null,{"$f":"SUM(R15,R20,R25,R30,R35,R39,R43,R47,R51,R55,R59,R63,R68,R73,R78)","v":0},null,null,null,null,null,null,"Andere"]
[]
[null,null,"Matrix ","Delegationsleiter"]
[null,null,{"$f":"'1 Deckblatt St.2024-04-09'!$J$50","v":0},{"$f":"C64","v":"TTBW"},null,null,null,{"$f":"IF(C93=D92,D93,\"kein Deli\")","v":"kein Deli"},null,null,null,null,{"$f":"ADDRESS(14+MATCH(H93,C11:C78,0),19)","v":{"$error":"#N/A"}},null,null,{"$f":"IF(ISNA(INDIRECT(M93)),0,INDIRECT(M93))","v":0}]
[null,null,{"$f":"'1 Deckblatt St.2024-04-09'!$J$51","v":0},{"$f":"C69","v":"TTBW"},null,null,null,{"$f":"IF(C94=D92,D94,\"kein Deli\")","v":"kein Deli"},null,null,null,null,{"$f":"ADDRESS(14+MATCH(H94,C11:C78,0),19)","v":{"$error":"#N/A"}},null,null,{"$f":"IF(ISNA(INDIRECT(M94)),0,INDIRECT(M94))","v":0}]
[null,null,{"$f":"'1 Deckblatt St.2024-04-09'!$J$52","v":0},{"$f":"C74","v":"TTBW"},null,null,null,{"$f":"IF(C95=D92,D95,\"kein Deli\")","v":"kein Deli"},null,null,null,null,{"$f":"ADDRESS(14+MATCH(H95,C11:C78,0),19)","v":{"$error":"#N/A"}},null,null,{"$f":"IF(ISNA(INDIRECT(M95)),0,INDIRECT(M95))","v":0}]
[null,null,{"$f":"'1 Deckblatt St.2024-04-09'!$J$53","v":0},{"$f":"C79","v":"TTBW"},null,null,null,{"$f":"IF(C96=D92,D96,\"kein Deli\")","v":"kein Deli"},null,null,null,null,{"$f":"ADDRESS(14+MATCH(H96,C12:C79,0),19)","v":{"$error":"#N/A"}},null,null,{"$f":"IF(ISNA(INDIRECT(M96)),0,INDIRECT(M96))","v":0}]
[null,null,null,null,null,null,null,null,null,null,null,null,"Summe",null,null,{"$f":"SUM(P93:P95)","v":0}]

{"sheet":"5 Fahrgeld + s.A.","index":4,"n_rows":64,"n_cols":25,"rows_kept":64,"cut":false,"hidden":false,"merged":[[62,11,62,12],[8,10,8,12],[9,10,9,12],[8,7,8,9],[57,15,57,16],[59,15,59,16],[60,15,60,16],[42,15,42,16],[43,15,43,16],[44,15,44,16],[61,15,61,16],[51,15,51,16],[52,15,52,16],[53,15,53,16],[54,15,54,16],[55,15,55,16],[56,15,56,16],[58,15,58,16],[37,15,37,16],[38,15,38,16],[39,15,39,16],[45,15,45,16],[40,15,40,16],[46,15,46,16],[48,15,48,16],[47,15,47,16],[49,15,49,16],[50,15,50,16],[2,13,2,15],[1,13,1,16],[3,13,3,15],[4,13,4,16],[11,15,12,16],[10,15,10,16],[6,15,9,16],[5,1,5,16],[11,11,12,11],[10,1,12,1],[10,2,12,2],[11,9,12,9],[8,3,11,3],[8,6,11,6],[12,3,12,6],[9,7,9,9],[11,7,12,7],[11,8,12,8],[13,15,13,16],[14,15,14,16],[20,15,20,16],[15,15,15,16],[16,15,16,16],[17,15,17,16],[19,15,19,16],[18,15,18,16],[21,15,21,16],[22,15,22,16],[62,1,62,2],[63,1,63,2],[61,8,61,10],[62,3,62,4],[63,3,63,4],[25,15,25,16],[23,15,23,16],[24,15,24,16],[33,15,33,16],[34,15,34,16],[35,15,35,16],[62,5,62,9],[63,5,63,9],[26,15,26,16],[27,15,27,16],[28,15,28,16],[29,15,29,16],[41,15,41,16],[31,15,31,16],[30,15,30,16],[32,15,32,16],[36,15,36,16],[3,1,3,6],[1,1,1,12],[2,1,2,12],[3,7,3,12],[4,1,4,12],[10,7,10,8],[10,23,12,23],[10,20,12,20],[10,19,12,19],[10,21,12,21],[7,13,10,13],[7,14,10,14],[11,14,12,14],[11,13,12,13],[10,22,12,22],[6,1,7,12],[11,12,12,12],[10,10,10,12],[11,10,12,10],[8,4,11,4],[8,5,11,5]]}
[]
[]
[null,"Tischtennis Baden-Württemberg e.V.",null,null,null,null,null,null,null,null,null,null,null,{"$f":"IF(Kostenstelle=\"\",\"\",Kostenstelle)","v":""}]
[null,"Veranstaltung:",null,null,null,null,null,{"$f":"IF(Veranstaltung=\"\",\"\",Veranstaltung)","v":""},null,null,null,null,null,"Kostenstelle"]
[]
[]
[null,"Fahrgeld, sonst. Auslagen und Teilnehmergebühren für Betreuer und Spieler"]
[null,null,null,null,null,null,null,null,null,null,null,null,null,"Lehrgangs-Gebühren (15,- €/Tag)","Teilnehmer-Gebühren"]
[null,null,null,"TTBW-Trainer (LSV)","Trainer + Deli","ehrenamtl. MA","Spieler"]
[null,null,null,null,null,null,null,"-------  Fahrkosten  -------"]
[null,"Nr.","Name, Vorname",null,null,null,null,"Pkw",null,"öffentl.\nVkM\n(lt. Beleg)","----------  Sonstige Auslagen  (lt. Beleg)  ----------",null,null,null,null,"Summe",null,null,null,"Typ-\nNr.",null,null,"€/km","Personen-Liste "]
[null,null,null,null,null,null,null,"km","€","€","Sach-\nkonto","Bezeichnung","€","€","€","€"]
[null,null,null,"(Zutr. mit X mark.)"]
[null,"B1",{"$f":"IF('1 Deckblatt St.2024-04-09'!F42=\"\",\"\",CONCATENATE('1 Deckblatt St.2024-04-09'!F42,\", \",'1 Deckblatt St.2024-04-09'!G42))","v":""},{"$f":"IF(C14=\"\",\"\",IF(COUNTIF('4 Honorar+TG, Betreuer'!K11:K14,\"x\")>0,\"x\",\"\"))","v":""},{"$f":"IF(C14=\"\",\"\",IF(COUNTIF('4 Honorar+TG, Betreuer'!L11:L14,\"x\")>0,\"x\",\"\"))","v":""},{"$f":"IF(C14=\"\",\"\",IF(AND(D14=\"\",E14=\"\"),\"x\",\"\"))","v":""},null,null,{"$f":"IF(OR(C14=\"\",COUNTIF(D14:G14,\"x\")>1),\"\",H14*U14)","v":""},null,{"$f":"IF(ISNA(VLOOKUP(L14,$X$20:$Y$27,2,FALSE)),\"\",VLOOKUP(L14,$X$20:$Y$27,2,FALSE))","v":""},null,null,null,null,{"$f":"IF(C14=\"\",\"\",SUM(I14,J14,M14,-N14,-O14))","v":""},null,null,null,{"$f":"IF(D14=\"X\",1,IF(E14=\"X\",2,IF(F14=\"X\",3,IF(G14=\"X\",4,\"\"))))","v":""},{"$f":"IF(C14=\"\",\"\",VLOOKUP(T14,$V$14:$W$17,2))","v":""},1,0.3,"TTBW-Trainer (LSV)"]
[null,"B2",{"$f":"IF('1 Deckblatt St.2024-04-09'!F43=\"\",\"\",CONCATENATE('1 Deckblatt St.2024-04-09'!F43,\", \",'1 Deckblatt St.2024-04-09'!G43))","v":""},{"$f":"IF(C15=\"\",\"\",IF(COUNTIF('4 Honorar+TG, Betreuer'!K16:K19,\"x\")>0,\"x\",\"\"))","v":""},{"$f":"IF(C15=\"\",\"\",IF(COUNTIF('4 Honorar+TG, Betreuer'!L16:L19,\"x\")>0,\"x\",\"\"))","v":""},"",null,null,{"$f":"IF(OR(C15=\"\",COUNTIF(D15:G15,\"x\")>1),\"\",H15*U15)","v":""},null,{"$f":"IF(ISNA(VLOOKUP(L15,$X$20:$Y$27,2,FALSE)),\"\",VLOOKUP(L15,$X$20:$Y$27,2,FALSE))","v":""},null,null,null,null,{"$f":"IF(C15=\"\",\"\",SUM(I15,J15,M15,-N15,-O15))","v":""},null,null,null,"","",2,0.25,"Honorar-Trainer + Deli"]
[null,"B3",{"$f":"IF('1 Deckblatt St.2024-04-09'!F44=\"\",\"\",CONCATENATE('1 Deckblatt St.2024-04-09'!F44,\", \",'1 Deckblatt St.2024-04-09'!G44))","v":""},{"$f":"IF(C16=\"\",\"\",IF(COUNTIF('4 Honorar+TG, Betreuer'!K21:K24,\"x\")>0,\"x\",\"\"))","v":""},{"$f":"IF(C16=\"\",\"\",IF(COUNTIF('4 Honorar+TG, Betreuer'!L21:L24,\"x\")>0,\"x\",\"\"))","v":""},"",null,null,"",null,null,null,null,null,null,"",null,null,null,"","",3,0.3,"Funktionäre u.a."]
[null,"B4",{"$f":"IF('1 Deckblatt St.2024-04-09'!F45=\"\",\"\",CONCATENATE('1 Deckblatt St.2024-04-09'!F45,\", \",'1 Deckblatt St.2024-04-09'!G45))","v":""},{"$f":"IF(C17=\"\",\"\",IF(COUNTIF('4 Honorar+TG, Betreuer'!K26:K29,\"x\")>0,\"x\",\"\"))","v":""},{"$f":"IF(C17=\"\",\"\",IF(COUNTIF('4 Honorar+TG, Betreuer'!L26:L29,\"x\")>0,\"x\",\"\"))","v":""},"",null,null,"",null,"",null,null,null,null,"",null,null,null,"","",4,0,"Spieler"]
[null,"B5",{"$f":"IF('1 Deckblatt St.2024-04-09'!F46=\"\",\"\",CONCATENATE('1 Deckblatt St.2024-04-09'!F46,\", \",'1 Deckblatt St.2024-04-09'!G46))","v":""},{"$f":"IF(C18=\"\",\"\",IF(COUNTIF('4 Honorar+TG, Betreuer'!K31:K34,\"x\")>0,\"x\",\"\"))","v":""},{"$f":"IF(C18=\"\",\"\",IF(COUNTIF('4 Honorar+TG, Betreuer'!L31:L34,\"x\")>0,\"x\",\"\"))","v":""},"",null,null,"",null,"",null,null,null,null,"",null,null,null,"",""]
[null,"B6",{"$f":"IF('1 Deckblatt St.2024-04-09'!F47=\"\",\"\",CONCATENATE('1 Deckblatt St.2024-04-09'!F47,\", \",'1 Deckblatt St.2024-04-09'!G47))","v":""},{"$f":"IF(C19=\"\",\"\",IF(COUNTIF('4 Honorar+TG, Betreuer'!K36:K38,\"x\")>0,\"x\",\"\"))","v":""},{"$f":"IF(C19=\"\",\"\",IF(COUNTIF('4 Honorar+TG, Betreuer'!L36:L38,\"x\")>0,\"x\",\"\"))","v":""},"",null,null,"",null,"",null,null,null,null,"",null,null,null,"","",null,null,"Liste sonst. Auslagen","SK"]
[null,"B7",{"$f":"IF('1 Deckblatt St.2024-04-09'!K42=\"\",\"\",CONCATENATE('1 Deckblatt St.2024-04-09'!K42,\", \",'1 Deckblatt St.2024-04-09'!L42))","v":""},{"$f":"IF(C20=\"\",\"\",IF(COUNTIF('4 Honorar+TG, Betreuer'!K40:K42,\"x\")>0,\"x\",\"\"))","v":""},{"$f":"IF(C20=\"\",\"\",IF(COUNTIF('4 Honorar+TG, Betreuer'!L40:L42,\"x\")>0,\"x\",\"\"))","v":""},"",null,null,"",null,"",null,null,null,null,"",null,null,null,"","",null,null,"Parkgebühren",2560]
[null,"B8",{"$f":"IF('1 Deckblatt St.2024-04-09'!K43=\"\",\"\",CONCATENATE('1 Deckblatt St.2024-04-09'!K43,\", \",'1 Deckblatt St.2024-04-09'!L43))","v":""},{"$f":"IF(C21=\"\",\"\",IF(COUNTIF('4 Honorar+TG, Betreuer'!K44:K46,\"x\")>0,\"x\",\"\"))","v":""},{"$f":"IF(C21=\"\",\"\",IF(COUNTIF('4 Honorar+TG, Betreuer'!L44:L46,\"x\")>0,\"x\",\"\"))","v":""},"",null,null,"",null,"",null,null,null,null,"",null,null,null,"","",null,null,"Flugtickets",2560]
[null,"B9",{"$f":"IF('1 Deckblatt St.2024-04-09'!K44=\"\",\"\",CONCATENATE('1 Deckblatt St.2024-04-09'!K44,\", \",'1 Deckblatt St.2024-04-09'!L44))","v":""},{"$f":"IF(C22=\"\",\"\",IF(COUNTIF('4 Honorar+TG, Betreuer'!K48:K50,\"x\")>0,\"x\",\"\"))","v":""},{"$f":"IF(C22=\"\",\"\",IF(COUNTIF('4 Honorar+TG, Betreuer'!L48:L50,\"x\")>0,\"x\",\"\"))","v":""},"",null,null,"",null,"",null,null,null,null,"",null,null,null,"","",null,null,"Andere","überschreiben"]
[null,"B10",{"$f":"IF('1 Deckblatt St.2024-04-09'!K45=\"\",\"\",CONCATENATE('1 Deckblatt St.2024-04-09'!K45,\", \",'1 Deckblatt St.2024-04-09'!L45))","v":""},{"$f":"IF(C23=\"\",\"\",IF(COUNTIF('4 Honorar+TG, Betreuer'!K52:K54,\"x\")>0,\"x\",\"\"))","v":""},{"$f":"IF(C23=\"\",\"\",IF(COUNTIF('4 Honorar+TG, Betreuer'!L52:L54,\"x\")>0,\"x\",\"\"))","v":""},"",null,null,"",null,"",null,null,null,null,"",null,null,null,"",""]
[null,"B11",{"$f":"IF('1 Deckblatt St.2024-04-09'!K46=\"\",\"\",CONCATENATE('1 Deckblatt St.2024-04-09'!K46,\", \",'1 Deckblatt St.2024-04-09'!L46))","v":""},{"$f":"IF(C24=\"\",\"\",IF(COUNTIF('4 Honorar+TG, Betreuer'!K56:K58,\"x\")>0,\"x\",\"\"))","v":""},{"$f":"IF(C24=\"\",\"\",IF(COUNTIF('4 Honorar+TG, Betreuer'!L56:L58,\"x\")>0,\"x\",\"\"))","v":""},"",null,null,"",null,"",null,null,null,null,"",null,null,null,"",""]
[null,"B12",{"$f":"IF('1 Deckblatt St.2024-04-09'!K47=\"\",\"\",CONCATENATE('1 Deckblatt St.2024-04-09'!K47,\", \",'1 Deckblatt St.2024-04-09'!L47))","v":""},{"$f":"IF(C25=\"\",\"\",IF(COUNTIF('4 Honorar+TG, Betreuer'!K60:K62,\"x\")>0,\"x\",\"\"))","v":""},{"$f":"IF(C25=\"\",\"\",IF(COUNTIF('4 Honorar+TG, Betreuer'!L60:L62,\"x\")>0,\"x\",\"\"))","v":""},"",null,null,"",null,"",null,null,null,null,"",null,null,null,"",""]
[null,"B13",{"$f":"IF('1 Deckblatt St.2024-04-09'!F50=\"\",\"\",CONCATENATE('1 Deckblatt St.2024-04-09'!F50,\", \",'1 Deckblatt St.2024-04-09'!G50))","v":""},{"$f":"IF(C26=\"\",\"\",IF(COUNTIF('4 Honorar+TG, Betreuer'!K64:K67,\"x\")>0,\"x\",\"\"))","v":""},{"$f":"IF(C26=\"\",\"\",IF(COUNTIF('4 Honorar+TG, Betreuer'!L64:L67,\"x\")>0,\"x\",\"\"))","v":""},"",null,null,"",null,"",null,null,null,null,"",null,null,null,"",""]
[null,"B14",{"$f":"IF('1 Deckblatt St.2024-04-09'!F51=\"\",\"\",CONCATENATE('1 Deckblatt St.2024-04-09'!F51,\", \",'1 Deckblatt St.2024-04-09'!G51))","v":""},{"$f":"IF(C27=\"\",\"\",IF(COUNTIF('4 Honorar+TG, Betreuer'!K69:K72,\"x\")>0,\"x\",\"\"))","v":""},{"$f":"IF(C27=\"\",\"\",IF(COUNTIF('4 Honorar+TG, Betreuer'!L69:L72,\"x\")>0,\"x\",\"\"))","v":""},"",null,null,"",null,"",null,null,null,null,"",null,null,null,"",""]
[null,"B15",{"$f":"IF('1 Deckblatt St.2024-04-09'!F52=\"\",\"\",CONCATENATE('1 Deckblatt St.2024-04-09'!F52,\", \",'1 Deckblatt St.2024-04-09'!G52))","v":""},{"$f":"IF(C28=\"\",\"\",IF(COUNTIF('4 Honorar+TG, Betreuer'!K74:K77,\"x\")>0,\"x\",\"\"))","v":""},{"$f":"IF(C28=\"\",\"\",IF(COUNTIF('4 Honorar+TG, Betreuer'!L74:L77,\"x\")>0,\"x\",\"\"))","v":""},"",null,null,"",null,"",null,null,null,null,"",null,null,null,"",""]
[null,"B16",{"$f":"IF('1 Deckblatt St.2024-04-09'!F53=\"\",\"\",CONCATENATE('1 Deckblatt St.2024-04-09'!F53,\", \",'1 Deckblatt St.2024-04-09'!G53))","v":""},{"$f":"IF(C29=\"\",\"\",IF(COUNTIF('4 Honorar+TG, Betreuer'!K79:K82,\"x\")>0,\"x\",\"\"))","v":""},{"$f":"IF(C29=\"\",\"\",IF(COUNTIF('4 Honorar+TG, Betreuer'!L79:L82,\"x\")>0,\"x\",\"\"))","v":""},{"$f":"IF(C29=\"\",\"\",IF(AND(D29=\"\",E29=\"\"),\"x\",\"\"))","v":""},null,null,"",null,"",null,null,null,null,"",null,null,null,"",""]
[null,"S1",{"$f":"IF('1 Deckblatt St.2024-04-09'!F24=\"\",\"\",CONCATENATE('1 Deckblatt St.2024-04-09'!F24,\", \",'1 Deckblatt St.2024-04-09'!G24))","v":""},null,null,null,{"$f":"IF(C30=\"\",\"\",\"x\")","v":""},null,{"$f":"IF(OR(C30=\"\",COUNTIF(D30:G30,\"x\")>1),\"\",H30*U30)","v":""},null,"",null,null,null,null,"",null,null,null,"",""]
[null,"S2",{"$f":"IF('1 Deckblatt St.2024-04-09'!F25=\"\",\"\",CONCATENATE('1 Deckblatt St.2024-04-09'!F25,\", \",'1 Deckblatt St.2024-04-09'!G25))","v":""},null,null,null,"",null,"",null,{"$f":"IF(ISNA(VLOOKUP(L31,$X$20:$Y$27,2,FALSE)),\"\",VLOOKUP(L31,$X$20:$Y$27,2,FALSE))","v":""},null,null,null,null,"",null,null,null,"",""]
[null,"S3",{"$f":"IF('1 Deckblatt St.2024-04-09'!F26=\"\",\"\",CONCATENATE('1 Deckblatt St.2024-04-09'!F26,\", \",'1 Deckblatt St.2024-04-09'!G26))","v":""},null,null,null,{"$f":"IF(C32=\"\",\"\",\"x\")","v":""},null,"",null,"",null,null,null,null,"",null,null,null,"",""]
[null,"S4",{"$f":"IF('1 Deckblatt St.2024-04-09'!F27=\"\",\"\",CONCATENATE('1 Deckblatt St.2024-04-09'!F27,\", \",'1 Deckblatt St.2024-04-09'!G27))","v":""},null,null,null,"",null,"",null,"",null,null,null,null,"",null,null,null,"",""]
[null,"S5",{"$f":"IF('1 Deckblatt St.2024-04-09'!F28=\"\",\"\",CONCATENATE('1 Deckblatt St.2024-04-09'!F28,\", \",'1 Deckblatt St.2024-04-09'!G28))","v":""},null,null,null,"",null,"",null,"",null,null,null,null,"",null,null,null,"",""]
[null,"S6",{"$f":"IF('1 Deckblatt St.2024-04-09'!F29=\"\",\"\",CONCATENATE('1 Deckblatt St.2024-04-09'!F29,\", \",'1 Deckblatt St.2024-04-09'!G29))","v":""},null,null,null,"",null,"",null,"",null,null,null,null,"",null,null,null,"",""]
[null,"S7",{"$f":"IF('1 Deckblatt St.2024-04-09'!F30=\"\",\"\",CONCATENATE('1 Deckblatt St.2024-04-09'!F30,\", \",'1 Deckblatt St.2024-04-09'!G30))","v":""},null,null,null,"",null,"",null,"",null,null,null,null,"",null,null,null,"",""]
[null,"S8",{"$f":"IF('1 Deckblatt St.2024-04-09'!F31=\"\",\"\",CONCATENATE('1 Deckblatt St.2024-04-09'!F31,\", \",'1 Deckblatt St.2024-04-09'!G31))","v":""},null,null,null,"",null,"",null,"",null,null,null,null,"",null,null,null,"",""]
[null,"S9",{"$f":"IF('1 Deckblatt St.2024-04-09'!F32=\"\",\"\",CONCATENATE('1 Deckblatt St.2024-04-09'!F32,\", \",'1 Deckblatt St.2024-04-09'!G32))","v":""},null,null,null,"",null,"",null,"",null,null,null,null,"",null,null,null,"",""]
[null,"S10",{"$f":"IF('1 Deckblatt St.2024-04-09'!F33=\"\",\"\",CONCATENATE('1 Deckblatt St.2024-04-09'!F33,\", \",'1 Deckblatt St.2024-04-09'!G33))","v":""},null,null,null,"",null,"",null,"",null,null,null,null,"",null,null,null,"",""]
[null,"S11",{"$f":"IF('1 Deckblatt St.2024-04-09'!F34=\"\",\"\",CONCATENATE('1 Deckblatt St.2024-04-09'!F34,\", \",'1 Deckblatt St.2024-04-09'!G34))","v":""},null,null,null,"",null,"",null,"",null,null,null,null,"",null,null,null,"",""]
[null,"S12",{"$f":"IF('1 Deckblatt St.2024-04-09'!F35=\"\",\"\",CONCATENATE('1 Deckblatt St.2024-04-09'!F35,\", \",'1 Deckblatt St.2024-04-09'!G35))","v":""},null,null,null,"",null,"",null,"",null,null,null,null,"",null,null,null,"",""]
[null,"S13",{"$f":"IF('1 Deckblatt St.2024-04-09'!F36=\"\",\"\",CONCATENATE('1 Deckblatt St.2024-04-09'!F36,\", \",'1 Deckblatt St.2024-04-09'!G36))","v":""},null,null,null,"",null,"",null,"",null,null,null,null,"",null,null,null,"",""]
[null,"S14",{"$f":"IF('1 Deckblatt St.2024-04-09'!F37=\"\",\"\",CONCATENATE('1 Deckblatt St.2024-04-09'!F37,\", \",'1 Deckblatt St.2024-04-09'!G37))","v":""},null,null,null,"",null,"",null,"",null,null,null,null,"",null,null,null,"",""]
[null,"S15",{"$f":"IF('1 Deckblatt St.2024-04-09'!F38=\"\",\"\",CONCATENATE('1 Deckblatt St.2024-04-09'!F38,\", \",'1 Deckblatt St.2024-04-09'!G38))","v":""},null,null,null,"",null,"",null,"",null,null,null,null,"",null,null,null,"",""]
[null,"S16",{"$f":"IF('1 Deckblatt St.2024-04-09'!F39=\"\",\"\",CONCATENATE('1 Deckblatt St.2024-04-09'!F39,\", \",'1 Deckblatt St.2024-04-09'!G39))","v":""},null,null,null,"",null,"",null,"",null,null,null,null,"",null,null,null,"",""]
[null,"S17",{"$f":"IF('1 Deckblatt St.2024-04-09'!K24=\"\",\"\",CONCATENATE('1 Deckblatt St.2024-04-09'!K24,\", \",'1 Deckblatt St.2024-04-09'!L24))","v":""},null,null,null,"",null,"",null,"",null,null,null,null,"",null,null,null,"",""]
[null,"S18",{"$f":"IF('1 Deckblatt St.2024-04-09'!K25=\"\",\"\",CONCATENATE('1 Deckblatt St.2024-04-09'!K25,\", \",'1 Deckblatt St.2024-04-09'!L25))","v":""},null,null,null,"",null,"",null,"",null,null,null,null,"",null,null,null,"",""]
[null,"S19",{"$f":"IF('1 Deckblatt St.2024-04-09'!K26=\"\",\"\",CONCATENATE('1 Deckblatt St.2024-04-09'!K26,\", \",'1 Deckblatt St.2024-04-09'!L26))","v":""},null,null,null,"",null,"",null,"",null,null,null,null,null,null,null,null,"",""]
[null,"S20",{"$f":"IF('1 Deckblatt St.2024-04-09'!K27=\"\",\"\",CONCATENATE('1 Deckblatt St.2024-04-09'!K27,\", \",'1 Deckblatt St.2024-04-09'!L27))","v":""},null,null,null,"",null,"",null,"",null,null,null,null,"",null,null,null,"",""]
[null,"S21",{"$f":"IF('1 Deckblatt St.2024-04-09'!K28=\"\",\"\",CONCATENATE('1 Deckblatt St.2024-04-09'!K28,\", \",'1 Deckblatt St.2024-04-09'!L28))","v":""},null,null,null,"",null,"",null,"",null,null,null,null,"",null,null,null,"",""]
[null,"S22",{"$f":"IF('1 Deckblatt St.2024-04-09'!K29=\"\",\"\",CONCATENATE('1 Deckblatt St.2024-04-09'!K29,\", \",'1 Deckblatt St.2024-04-09'!L29))","v":""},null,null,null,"",null,"",null,"",null,null,null,null,"",null,null,null,"",""]
[null,"S23",{"$f":"IF('1 Deckblatt St.2024-04-09'!K30=\"\",\"\",CONCATENATE('1 Deckblatt St.2024-04-09'!K30,\", \",'1 Deckblatt St.2024-04-09'!L30))","v":""},null,null,null,"",null,"",null,"",null,null,null,null,"",null,null,null,"",""]
[null,"S24",{"$f":"IF('1 Deckblatt St.2024-04-09'!K31=\"\",\"\",CONCATENATE('1 Deckblatt St.2024-04-09'!K31,\", \",'1 Deckblatt St.2024-04-09'!L31))","v":""},null,null,null,"",null,"",null,"",null,null,null,null,"",null,null,null,"",""]
[null,"S25",{"$f":"IF('1 Deckblatt St.2024-04-09'!K32=\"\",\"\",CONCATENATE('1 Deckblatt St.2024-04-09'!K32,\", \",'1 Deckblatt St.2024-04-09'!L32))","v":""},null,null,null,"",null,"",null,"",null,null,null,null,"",null,null,null,"",""]
[null,"S26",{"$f":"IF('1 Deckblatt St.2024-04-09'!K33=\"\",\"\",CONCATENATE('1 Deckblatt St.2024-04-09'!K33,\", \",'1 Deckblatt St.2024-04-09'!L33))","v":""},null,null,null,"",null,"",null,"",null,null,null,null,"",null,null,null,"",""]
[null,"S27",{"$f":"IF('1 Deckblatt St.2024-04-09'!K34=\"\",\"\",CONCATENATE('1 Deckblatt St.2024-04-09'!K34,\", \",'1 Deckblatt St.2024-04-09'!L34))","v":""},null,null,null,"",null,"",null,"",null,null,null,null,"",null,null,null,"",""]
[null,"S28",{"$f":"IF('1 Deckblatt St.2024-04-09'!K35=\"\",\"\",CONCATENATE('1 Deckblatt St.2024-04-09'!K35,\", \",'1 Deckblatt St.2024-04-09'!L35))","v":""},null,null,null,"",null,"",null,"",null,null,null,null,"",null,null,null,"",""]
[null,"S29",{"$f":"IF('1 Deckblatt St.2024-04-09'!K36=\"\",\"\",CONCATENATE('1 Deckblatt St.2024-04-09'!K36,\", \",'1 Deckblatt St.2024-04-09'!L36))","v":""},null,null,null,"",null,"",null,"",null,null,null,null,"",null,null,null,"",""]
[null,"S30",{"$f":"IF('1 Deckblatt St.2024-04-09'!K37=\"\",\"\",CONCATENATE('1 Deckblatt St.2024-04-09'!K37,\", \",'1 Deckblatt St.2024-04-09'!L37))","v":""},null,null,null,{"$f":"IF(C59=\"\",\"\",\"x\")","v":""},null,"",null,{"$f":"IF(ISNA(VLOOKUP(L59,$X$20:$Y$27,2,FALSE)),\"\",VLOOKUP(L59,$X$20:$Y$27,2,FALSE))","v":""},null,null,null,null,""]
[null,"S31",{"$f":"IF('1 Deckblatt St.2024-04-09'!K38=\"\",\"\",CONCATENATE('1 Deckblatt St.2024-04-09'!K38,\", \",'1 Deckblatt St.2024-04-09'!L38))","v":""},null,null,null,"",null,"",null,"",null,null,null,null,"",null,null,null,"",{"$f":"IF(C60=\"\",\"\",VLOOKUP(T60,$V$14:$W$17,2))","v":""}]
[null,"S32",{"$f":"IF('1 Deckblatt St.2024-04-09'!K39=\"\",\"\",CONCATENATE('1 Deckblatt St.2024-04-09'!K39,\", \",'1 Deckblatt St.2024-04-09'!L39))","v":""},null,null,null,"",null,"",null,"",null,null,null,null,"",null,null,null,"",{"$f":"IF(C61=\"\",\"\",VLOOKUP(T61,$V$14:$W$17,2))","v":""}]
[null,null,null,null,null,null,null,null,"Summen:",null,null,null,{"$f":"SUM(M14:M61)","v":0},{"$f":"SUM(N14:N61)","v":0},{"$f":"SUM(O14:O61)","v":0},{"$f":"SUM(P14:P61)","v":0}]
[null,"FK: Öffentl. Verkehrsmittel",null,{"$f":"SUM($J$14:$J$61)","v":0},null,"FK: km-Geld, hauptamtl. Trainer",null,null,null,null,{"$f":"SUMIF($D$14:$D$61,\"x\",$I$14:$I$61)","v":0},{"$f":"IF(M62=0,\"\",\"SK-Nummer auf Blatt 2 übertragen\")","v":""}]
[null,"FK: km-Geld, Honorartrainer",null,{"$f":"SUMIF($E$14:$E$61,\"x\",$I$14:$I$61)","v":0},null,"FK: km-Geld, Ehrenamtliche",null,null,null,null,{"$f":"SUMIF($F$14:$F$61,\"x\",$I$14:$I$61)","v":0}]

{"sheet":"6 Sonstige Kosten","index":5,"n_rows":80,"n_cols":15,"rows_kept":80,"cut":false,"hidden":false,"merged":[[78,1,78,15],[76,14,76,15],[71,14,73,15],[74,8,74,12],[76,3,76,4],[79,6,79,10],[79,11,79,12],[79,13,79,15],[77,1,77,15],[71,8,73,12],[71,13,73,13],[74,14,74,15],[74,2,74,3],[75,8,75,12],[76,7,76,13],[75,2,75,3],[72,4,73,4],[72,5,73,5],[69,5,71,5],[67,7,70,12],[67,13,70,13],[67,14,70,15],[75,14,75,15],[69,1,71,1],[76,1,76,2],[72,1,73,1],[72,2,73,3],[71,7,73,7],[69,4,71,4],[57,13,59,13],[60,1,60,5],[60,7,62,7],[61,1,64,3],[61,4,64,4],[66,7,66,15],[60,13,62,13],[60,14,62,15],[63,7,65,13],[63,14,65,15],[60,8,62,12],[57,1,59,4],[57,5,59,5],[65,1,68,1],[65,2,68,3],[65,4,68,4],[65,5,68,5],[61,5,64,5],[69,2,71,3],[49,7,52,12],[49,13,52,13],[48,5,50,5],[51,1,53,1],[54,1,56,1],[51,5,53,5],[53,8,56,12],[54,2,56,3],[54,4,56,4],[54,5,56,5],[51,4,53,4],[48,1,50,1],[48,2,50,3],[48,4,50,4],[53,13,56,13],[32,7,32,12],[40,18,41,18],[42,18,44,18],[45,7,47,13],[45,14,47,15],[42,14,44,15],[42,13,44,13],[40,13,41,13],[45,18,47,18],[42,8,44,12],[40,8,41,12],[30,14,30,15],[24,1,24,15],[26,8,27,12],[26,13,27,13],[26,2,27,3],[26,14,27,15],[28,2,28,3],[29,2,29,3],[25,1,25,3],[26,1,27,1],[44,2,47,3],[44,4,47,4],[44,5,47,5],[16,14,16,15],[17,14,18,15],[19,14,19,15],[20,14,20,15],[14,12,14,13],[14,9,14,11],[20,8,20,12],[14,14,14,15],[16,7,16,12],[17,13,18,13],[21,14,21,15],[17,2,18,2],[17,5,18,5],[32,14,32,15],[28,14,28,15],[26,7,27,7],[17,3,18,3],[26,4,27,4],[22,8,22,12],[30,7,30,13],[29,14,29,15],[53,14,56,15],[57,7,59,7],[57,8,59,12],[57,14,59,15],[53,7,56,7],[49,14,52,15],[51,2,53,3],[40,1,40,5],[33,1,34,1],[37,8,37,12],[39,14,39,15],[33,14,34,15],[35,8,35,12],[35,14,35,15],[36,8,36,12],[36,14,36,15],[48,7,48,15],[42,7,44,7],[40,14,41,15],[38,8,38,12],[41,1,43,3],[41,4,43,4],[41,5,43,5],[44,1,47,1],[17,1,18,1],[17,7,18,7],[17,8,18,12],[19,8,19,12],[17,4,18,4],[33,7,34,7],[30,1,30,4],[40,7,41,7],[25,7,25,12],[32,1,32,3],[37,2,37,3],[33,4,34,4],[21,8,21,12],[28,8,28,12],[38,2,38,3],[26,5,27,5],[33,2,34,3],[29,8,29,12],[39,8,39,12],[33,5,34,5],[35,2,35,3],[36,2,36,3],[39,1,39,4],[31,1,31,15],[10,14,10,15],[11,14,11,15],[38,14,38,15],[12,14,12,15],[13,14,13,15],[37,14,37,15],[22,14,22,15],[23,14,23,15],[25,14,25,15],[15,1,15,15],[12,2,12,6],[13,2,13,6],[13,12,13,13],[12,12,12,13],[10,2,10,6],[11,2,11,6],[14,1,14,7],[23,7,23,13],[23,1,23,4],[16,1,16,3],[10,12,10,13],[11,12,11,13],[33,8,34,12],[33,13,34,13],[1,1,1,11],[2,1,2,11],[6,14,6,15],[6,1,6,12],[7,14,8,15],[9,14,9,15],[9,12,9,13],[7,1,8,1],[1,12,1,15],[4,12,4,15],[3,12,3,14],[2,12,2,14],[5,1,5,15],[7,9,7,10],[3,3,3,11],[4,1,4,11],[3,1,3,2],[7,8,8,8],[8,12,8,13],[7,2,8,6],[9,2,9,6],[7,7,8,7],[7,11,7,13]]}
[]
[]
[null,"Tischtennis Baden-Württemberg e.V.",null,null,null,null,null,null,null,null,null,null,{"$f":"IF(Kostenstelle=\"\",\"\",Kostenstelle)","v":""}]
[null,"Veranstaltung:",null,{"$f":"IF(Veranstaltung=\"\",\"\",Veranstaltung)","v":""},null,null,null,null,null,null,null,null,"Kostenstelle"]
[]
[]
[null,"Mietwagen  (Autovermieter und TTVWH-Bus)",null,null,null,null,null,null,null,null,null,null,null,"SK:","2566"]
[null,"Fahrz.\nNr.","Gesellschaft",null,null,null,null,"Beleg\nNr.","Miete  \n€","Kraftstoff (1)",null,"Kraftstoff (2)",null,null,"Summe  \n€"]
[null,null,null,null,null,null,null,null,null,"Bel.Nr.","Kosten  €","Bel.Nr.","Kosten  €"]
[null,1,null,null,null,null,null,null,null,null,null,null,null,null,{"$f":"SUM(I10,K10,M10)","v":0}]
[null,2,null,null,null,null,null,null,null,null,null,null,null,null,{"$f":"SUM(I11,K11,M11)","v":0}]
[null,3,null,null,null,null,null,null,null,null,null,null,null,null,{"$f":"SUM(I12,K12,M12)","v":0}]
[null,4,null,null,null,null,null,null,null,null,null,null,null,null,{"$f":"SUM(I13,K13,M13)","v":0}]
[null,"5",null,null,null,null,null,null,null,null,null,null,null,null,{"$f":"SUM(I14,K14,M14)","v":0}]
[null,"Summe:",null,null,null,null,null,null,{"$f":"SUM(I10:I14)","v":0},null,null,null,{"$f":"SUM(M10:M14,K10:K14)","v":0},null,{"$f":"SUM(O10:O14)","v":0}]
[]
[null,"Übernachtung in Sportschule",null,null,"SK:","2568",null,"Übernachtung in Hotels  (Spieler, Betreuer)",null,null,null,null,null,"SK:","2567"]
[null,"Anzahl\nTN","Beschreibung","Team /\nAndere","Beleg\nNr.","Kosten  \n€",null,"Nr.","Beschreibung",null,null,null,null,"Beleg\nNr.","Kosten  \n€"]
[]
[null,null,null,null,null,null,null,"1"]
[null,null,null,null,null,null,null,"2"]
[null,null,null,null,null,null,null,"3"]
[null,null,null,null,null,null,null,"4"]
[null,"Summe: ",null,null,null,{"$f":"SUM(F20:F23)","v":0},null,"Summe:",null,null,null,null,null,null,{"$f":"SUM(O20:O23)","v":0}]
[]
[null,"Startgeld   (Einnahmen)",null,null,"SK:","2360",null,"Startgeld   (Ausgaben)",null,null,null,null,null,"SK:","2714"]
[null,"Anzahl\nTN","Beschreibung",null,"Beleg\nNr.","Betrag  \n€",null,"Anzahl\nTN","Beschreibung",null,null,null,null,"Beleg\nNr.","Kosten  \n€"]
[]
[]
[]
[null,"Summe: ",null,null,null,{"$f":"SUM(F29:F30)","v":0},null,"Summe:",null,null,null,null,null,null,{"$f":"SUM(O29:O30)","v":0}]
[]
[null,"Geschenke   (Preisgeld, Medaillen, Urkunden)",null,null,"SK:","2802",null,"Bewirtung   (Sportler u.a.)",null,null,null,null,null,"SK:","2570"]
[null,"Nr.","Beschreibung",null,"Beleg\nNr.","Kosten  \n€",null,"Datum","Beschreibung",null,null,null,null,"Beleg\nNr.","Kosten  \n€"]
[]
[null,1]
[null,2]
[null,3]
[null,4]
[null,"Summe: ",null,null,null,{"$f":"SUM(F36:F39)","v":0}]
[]
[null,"Repräsentation",null,null,"SK:","2810"]
[]
[]
[null,"Nr","Beschreibung",null,"Beleg\nNr.","Kosten  \n€"]
[null,null,null,null,null,null,null,"Summe:",null,null,null,null,null,null,{"$f":"SUM(O36:O45)","v":0}]
[]
[]
[null,"1"]
[null,null,null,null,null,null,null,"Ausrichterzuschuss",null,null,null,null,null,"SK:","2705"]
[]
[null,2]
[]
[null,null,null,null,null,null,null,"Nr.","Beschreibung",null,null,null,null,"Beleg\nNr.","Kosten  \n€"]
[null,"3"]
[]
[]
[null,"Summe: ",null,null,null,{"$f":"SUM(F49:F57)","v":0},null,"1"]
[]
[]
[null,null,null,null,null,null,null,"2"]
[null,"Sonstiges",null,null,"SK:","s.u."]
[]
[null,null,null,null,null,null,null,"Summe:",null,null,null,null,null,null,{"$f":"SUM(O58:O63)","v":0}]
[]
[null,"Sach-\nkonto","Beschreibung",null,"Beleg\nNr.","Kosten  \n€"]
[]
[null,null,null,null,null,null,null,"Dienstleistung  (Wäscherei, sonst. Raumkosten)",null,null,null,null,null,"SK:","2662"]
[]
[]
[]
[null,null,null,null,null,null,null,"Nr.","Beschreibung",null,null,null,null,"Beleg\nNr.","Kosten  \n€"]
[]
[]
[null,null,null,null,null,null,null,"1"]
[null,null,null,null,null,null,null,"2"]
[null,{"$f":"IF(F77=0,\"\",\"SK-Nummer auf Blatt 2 übertragen\")","v":""},null,"Summe: ",null,{"$f":"SUM(F70:F76)","v":0},null,"Summe:",null,null,null,null,null,null,{"$f":"SUM(O75:O76)","v":0}]
[]
[null,"Aufteilung Übernachtung Sportschule:"]
[null,1,"Team: Spieler, Betreuer",{"$f":"SUMIF(D20:D23,\"Team\",F20:F23)","v":0},null,2,"Andere: TL, Schiri",null,null,null,null,{"$f":"SUMIF(D20:D23,\"Andere\",F20:F23)","v":0}]

{"sheet":"7 Turnierleitung+Schiri","index":6,"n_rows":98,"n_cols":46,"rows_kept":98,"cut":false,"hidden":false,"merged":[[3,45,12,45],[8,17,10,17],[8,19,8,20],[29,3,29,4],[29,20,29,21],[30,3,30,4],[30,20,30,21],[7,41,12,41],[6,43,12,43],[12,28,12,33],[13,20,13,21],[14,20,14,21],[15,20,15,21],[17,20,17,21],[20,3,20,4],[16,20,16,21],[18,20,18,21],[19,20,19,21],[20,20,20,21],[11,25,12,25],[11,24,12,24],[11,26,12,26],[11,19,12,19],[8,42,12,42],[12,37,12,38],[3,40,12,40],[10,24,10,26],[4,18,4,21],[6,1,6,18],[9,26,9,27],[9,23,9,24],[10,23,12,23],[10,20,10,21],[8,1,8,4],[9,3,9,4],[8,14,8,16],[10,11,10,13],[12,5,12,9],[11,11,12,11],[10,14,10,15],[8,7,11,7],[11,17,12,17],[8,9,11,9],[11,12,12,12],[10,10,12,10],[9,14,9,16],[11,15,12,15],[5,1,5,21],[84,3,84,4],[82,3,82,4],[44,3,44,4],[31,3,31,4],[9,19,10,19],[9,20,9,21],[33,20,33,21],[61,3,61,4],[62,3,62,4],[63,3,63,4],[64,3,64,4],[57,3,57,4],[58,3,58,4],[59,3,59,4],[34,3,34,4],[34,20,34,21],[43,3,43,4],[43,20,43,21],[31,20,31,21],[32,3,32,4],[48,3,48,4],[49,3,49,4],[18,3,18,4],[19,3,19,4],[86,10,86,14],[41,3,41,4],[42,3,42,4],[45,3,45,4],[46,3,46,4],[78,3,78,4],[11,20,12,21],[83,3,83,4],[73,3,73,4],[74,3,74,4],[75,3,75,4],[76,3,76,4],[11,18,12,18],[11,16,12,16],[60,3,60,4],[35,3,35,4],[21,20,21,21],[53,3,53,4],[54,3,54,4],[86,8,86,9],[38,3,38,4],[39,3,39,4],[40,3,40,4],[47,3,47,4],[65,3,65,4],[36,3,36,4],[10,1,12,1],[10,2,12,2],[81,3,81,4],[21,3,21,4],[22,3,22,4],[23,3,23,4],[24,3,24,4],[16,3,16,4],[17,3,17,4],[50,3,50,4],[66,3,66,4],[10,3,12,4],[13,3,13,4],[14,3,14,4],[15,3,15,4],[55,3,55,4],[56,3,56,4],[37,3,37,4],[26,3,26,4],[86,16,86,19],[87,16,87,19],[27,3,27,4],[28,3,28,4],[33,3,33,4],[87,4,87,7],[85,1,85,14],[86,1,86,2],[87,1,87,2],[86,4,86,7],[85,17,85,18],[79,3,79,4],[80,3,80,4],[68,3,68,4],[69,3,69,4],[70,3,70,4],[67,3,67,4],[87,10,87,14],[51,3,51,4],[52,3,52,4],[87,8,87,9],[71,3,71,4],[72,3,72,4],[77,3,77,4],[7,1,7,16],[22,20,22,21],[23,20,23,21],[24,20,24,21],[25,20,25,21],[7,18,10,18],[1,1,1,17],[2,1,2,17],[3,5,3,17],[4,1,4,17],[6,19,6,21],[7,20,7,21],[3,1,3,4],[2,18,2,20],[1,18,1,21],[3,18,3,20],[8,5,11,5],[8,6,11,6],[8,8,11,8],[11,13,12,13],[11,14,12,14],[9,12,9,13],[8,12,8,13],[25,3,25,4],[9,28,9,34],[9,36,9,37],[48,20,48,21],[26,20,26,21],[27,20,27,21],[28,20,28,21],[65,20,65,21],[66,20,66,21],[67,20,67,21],[35,20,35,21],[36,20,36,21],[32,20,32,21],[45,20,45,21],[46,20,46,21],[47,20,47,21],[56,20,56,21],[57,20,57,21],[58,20,58,21],[59,20,59,21],[60,20,60,21],[61,20,61,21],[54,20,54,21],[55,20,55,21],[37,20,37,21],[75,20,75,21],[38,20,38,21],[39,20,39,21],[40,20,40,21],[41,20,41,21],[42,20,42,21],[49,20,49,21],[44,20,44,21],[50,20,50,21],[51,20,51,21],[76,20,76,21],[52,20,52,21],[53,20,53,21],[62,20,62,21],[63,20,63,21],[64,20,64,21],[87,20,87,21],[81,20,81,21],[82,20,82,21],[83,20,83,21],[84,20,84,21],[85,20,85,21],[86,20,86,21],[68,20,68,21],[69,20,69,21],[70,20,70,21],[80,20,80,21],[77,20,77,21],[78,20,78,21],[79,20,79,21],[71,20,71,21],[72,20,72,21],[73,20,73,21],[74,20,74,21]]}
[]
[]
[null,"Tischtennis Baden-Württemberg e.V.",null,null,null,null,null,null,null,null,null,null,null,null,null,null,null,null,{"$f":"IF(Kostenstelle=\"\",\"\",Kostenstelle)","v":""}]
[null,"Veranstaltung:",null,null,null,{"$f":"IF(Veranstaltung=\"\",\"\",Veranstaltung)","v":""},null,null,null,null,null,null,null,null,null,null,null,null,"Kostenstelle",null,null,null,null,null,null,null,null,null,null,null,null,null,null,null,null,null,null,null,null,null,"TL=2 / Schiri=3\nkein Name=0, Name,aber keine F.=1",null,null,null,null,"FSt-Abzug-Fehler"]
[]
[]
[null,"Auslagen für Turnierleitung und Schiedsrichter   (nur wenn TTBW Ausrichter ist)",null,null,null,null,null,null,null,null,null,null,null,null,null,null,null,null,null,null,null,null,null,null,null,null,null,null,null,null,null,null,null,null,null,null,null,null,null,null,null,null,null,"Tagegeld: JA"]
[null,null,null,null,null,null,null,null,null,null,null,null,null,null,null,null,null,null,"Abzug: Frühstück",null,null,null,null,null,null,null,null,null,null,null,null,null,null,null,null,null,null,null,null,null,null,"Anzahl Funktionen"]
[null,null,null,null,null,"Oberschiriedsr.","Schiedsrichter","Turnierleitung","Fahrer","Tagegeld",{"$f":"IF(AND(NOT(C46=\"\"),NOT(O46=\"\"),I46=\"\"),\"grün\",\"\")","v":""},{"$f":"IF(SUM(AQ14:AQ85)=0,\"\",SUM(AQ14:AQ85))","v":""},{"$f":"IF(L9=\"\",\"\",\"Funktionsfehler\")","v":""},null,null,null,null,"Hotelkosten",null,{"$f":"IF(V9=\"\",\"\",\"kein Abzug Frühstück?\")","v":""},null,{"$f":"IF(SUM(AT14:AT85)=0,\"\",SUM(AT14:AT85))","v":""},null,null,null,null,null,null,null,null,null,null,null,null,null,null,null,null,null,null,null,null,"Funktions-Fehler"]
[null,null,null,null,null,null,null,null,null,null,null,{"$f":"IF(SUM(AA14:AA85)=0,\"\",SUM(AA14:AA85))","v":""},{"$f":"IF(L10=\"\",\"\",\"Zeitfehler\")","v":""},null,"-------  Fahrkosten  -------",null,null,null,null,"Tagegeld",null,null,null,"Kilometersatz =",null,0.3,"€/km",null,"Frühstück-Abzug =",null,null,null,null,null,null,5.6,"€"]
[null,"Nr.","Name, Vorname","Wohnort",null,null,null,null,null,null,"Datum\n\nTT.MM"," ----------- Reise-  --------",null,null,"Pkw",null,"öffentl.\nVkM\n(lt. Beleg)",null,null,null,"Summe",null,null,"Tage mit Stunden ","Zeitfehler"]
[null,null,null,null,null,null,null,null,null,null,null,"Beginn\nhh:mm","Ende\nhh:mm","Dauer\nhh:mm","km","€","€","€","(x)","€","€",null,null,null,"keine Zeiten","eine Zeit fehlt"]
[null,null,null,null,null,"(Zutreff. mit X mark.)",null,null,null,null,null,null,null,null,null,null,null,null,null,null,null,null,null,null,null,null,null,null,"TG-Schlüssel",null,null,null,null,null,null,null,null,"TG-Satz"]
[null,1,null,null,null,null,null,null,null,null,null,null,null,{"$f":"IF(AND(Y14=\"\",Z14=\"\",NOT(C14=\"\")),IF(M14=\"\",\"24:00\"-L14,M14-L14),\"\")","v":""},null,{"$f":"IF(AR14=0,\"\",IF(I14=\"x\",O14*$Z$10,0))","v":""},null,null,null,{"$f":"IF(OR(AJ14=\"X\",AR14=0),\"\",AJ14)","v":""},null,null,null,{"$f":"COUNT(N14:N16)","v":0},{"$f":"IF(OR(C14=\"\",NOT(L14=\"\")),\"\",\"Zeiten ?\")","v":""},{"$f":"IF(OR(C14=\"\",COUNTA(L14:L16)=COUNT(M14:M16)),\"\",\"Zeiten ?\")","v":""},{"$f":"IF(AND(Y14=\"\",Z14=\"\"),0,IF(AND(NOT(Y14=\"\"),NOT(Z14=\"\")),2,1))","v":0},null,{"$f":"IF(J14=\"x\",1,0)","v":0},{"$f":"IF(AND(AC14=1,(IF(N14=\"\",0,N14)*24>0)),1,0)","v":0},{"$f":"IF(AND(AC14=1,(IF(N14=\"\",0,N14)*24>=5)),1,0)","v":0},{"$f":"IF(AND(AC14=1,(IF(N14=\"\",0,N14)*24>=8)),1,0)","v":0},{"$f":"IF(AND(AC14=1,(IF(N14=\"\",0,N14)*24>=24)),1,0)","v":0},{"$f":"IF(AND(AC14=1,NOT(N14=\"\"),X14>1),4,0)","v":0},{"$f":"SUM(AD14:AH14)","v":0},{"$f":"VLOOKUP(AI14,$AL$14:$AM$22,2)","v":"X"},null,0,"X",null,{"$f":"IF(C14=\"\",0,IF(OR(F14=\"x\",G14=\"x\"),3,IF(H14=\"x\",2,1)))","v":0},{"$f":"COUNTIF(F14:H14,\"x\")","v":0},{"$f":"IF(OR(AND(AO14=0,AP14=0),(AND(NOT(AO14=0),AP14=1))),0,1)","v":0},{"$f":"IF(AND(AA14=0,AQ14=0,AO14>1),1,0)","v":0}]
[null,null,null,null,null,null,null,null,null,null,null,null,null,{"$f":"IF(AND(Y14=\"\",Z14=\"\",NOT(C14=\"\")),IF(AND(M15=\"\",COUNTA(M16)>0),\"24:00\"-L15,IF((M15-L15)=0,\"\",M15-L15)),\"\")","v":""},null,null,null,null,null,{"$f":"IF(OR(AJ15=\"X\",AR14=0),\"\",AJ15-(IF(AND(S15=\"X\",AJ15-$AJ$10>0),$AJ$10,0)))","v":""},null,null,null,null,null,null,null,null,0,{"$f":"IF(AND(AC15=1,(IF(N15=\"\",0,N15)*24>0)),1,0)","v":0},{"$f":"IF(AND(AC15=1,(IF(N15=\"\",0,N15)*24>=5)),1,0)","v":0},{"$f":"IF(AND(AC15=1,(IF(N15=\"\",0,N15)*24>=8)),1,0)","v":0},{"$f":"IF(AND(AC15=1,(IF(N15=\"\",0,N15)*24>=24)),1,0)","v":0},{"$f":"IF(AND(AC15=1,NOT(N15=\"\"),X15>1),4,0)","v":0},{"$f":"SUM(AD15:AH15)","v":0},{"$f":"VLOOKUP(AI15,$AL$14:$AM$22,2)","v":"X"},null,1,0,null,{"$f":"IF(C14=\"\",0,IF(OR(F14=\"x\",G14=\"x\"),3,IF(H14=\"x\",2,1)))","v":0},null,null,null,null,{"$f":"IF(AND(NOT(C14=\"\"),NOT(R14=\"\"),NOT(N15=\"\"),S15=\"\"),1,\"\")","v":""}]
[null,null,null,null,null,null,null,null,null,null,null,null,null,{"$f":"IF(AND(Y14=\"\",Z14=\"\",NOT(C14=\"\")),IF((M16-L16)=0,\"\",M16-L16),\"\")","v":""},null,null,null,null,null,{"$f":"IF(OR(AJ16=\"X\",AR14=0),\"\",AJ16-(IF(AND(S16=\"X\",AJ16-$AJ$10>0),$AJ$10,0)))","v":""},{"$f":"IF(OR(C14=\"\",AQ14=1),\"\",IF(X14=1,SUM(P14:Q14,T14),SUM(P14:R14,T14:T16)))","v":""},null,null,null,null,null,null,null,{"$f":"IF(J16=\"x\",1,0)","v":0},0,0,0,0,0,{"$f":"SUM(AD16:AH16)","v":0},{"$f":"VLOOKUP(AI16,$AL$14:$AM$22,2)","v":"X"},null,2,14,null,{"$f":"IF(C14=\"\",0,IF(OR(F14=\"x\",G14=\"x\"),3,IF(H14=\"x\",2,1)))","v":0},null,null,null,null,{"$f":"IF(AND(NOT(C14=\"\"),NOT(R14=\"\"),NOT(N16=\"\"),S16=\"\"),1,\"\")","v":""}]
[null,2,null,null,null,null,null,null,null,null,null,null,null,{"$f":"IF(AND(Y17=\"\",Z17=\"\",NOT(C17=\"\")),IF(M17=\"\",\"24:00\"-L17,M17-L17),\"\")","v":""},null,{"$f":"IF(AR17=0,\"\",IF(I17=\"x\",O17*$Z$10,0))","v":""},null,null,null,{"$f":"IF(OR(AJ17=\"X\",AR17=0),\"\",AJ17-(IF(S17=\"X\",4.8,0)))","v":""},null,null,null,{"$f":"COUNT(N17:N19)","v":0},{"$f":"IF(OR(C17=\"\",NOT(L17=\"\")),\"\",\"Zeiten ?\")","v":""},{"$f":"IF(OR(C17=\"\",COUNTA(L17:L19)=COUNT(M17:M19)),\"\",\"Zeiten ?\")","v":""},{"$f":"IF(AND(Y17=\"\",Z17=\"\"),0,IF(AND(NOT(Y17=\"\"),NOT(Z17=\"\")),2,1))","v":0},null,{"$f":"IF(J17=\"x\",1,0)","v":0},0,0,0,0,0,0,{"$f":"VLOOKUP(AI17,$AL$14:$AM$22,2)","v":"X"},null,3,20,null,{"$f":"AO18","v":0},{"$f":"COUNTIF(F17:H17,\"x\")","v":0},{"$f":"IF(OR(AND(AO17=0,AP17=0),(AND(NOT(AO17=0),AP17=1))),0,1)","v":0},{"$f":"IF(AND(AQ17=0,AO17>1),1,0)","v":0}]
[null,null,null,null,null,null,null,null,null,null,null,null,null,{"$f":"IF(AND(Y17=\"\",Z17=\"\",NOT(C17=\"\")),IF(AND(M18=\"\",COUNTA(M19)>0),\"24:00\"-L18,IF((M18-L18)=0,\"\",M18-L18)),\"\")","v":""},null,null,null,null,null,{"$f":"IF(OR(AJ18=\"X\",AR17=0),\"\",AJ18-(IF(AND(S18=\"X\",AJ18-$AJ$10>0),$AJ$10,0)))","v":""},null,null,null,null,null,null,null,null,0,0,0,0,0,0,0,"X",null,4,24,null,{"$f":"IF(C17=\"\",0,IF(OR(F17=\"x\",G17=\"x\"),3,IF(H17=\"x\",2,1)))","v":0},null,null,null,null,{"$f":"IF(AND(NOT(C17=\"\"),NOT(R17=\"\"),NOT(N18=\"\"),S18=\"\"),1,\"\")","v":""}]
[null,null,null,null,null,null,null,null,null,null,null,null,null,{"$f":"IF(AND(Y17=\"\",Z17=\"\",NOT(C17=\"\")),IF((M19-L19)=0,\"\",M19-L19),\"\")","v":""},null,null,null,null,null,{"$f":"IF(OR(AJ19=\"X\",AR17=0),\"\",AJ19-(IF(AND(S19=\"X\",AJ19-$AJ$10>0),$AJ$10,0)))","v":""},{"$f":"IF(OR(C17=\"\",AQ17=1),\"\",IF(X17=1,SUM(P17:Q17,T17),SUM(P17:R17,T17:T19)))","v":""},null,null,null,null,null,null,null,0,0,0,0,0,0,0,"X",null,5,0,null,{"$f":"IF(C17=\"\",0,IF(OR(F17=\"x\",G17=\"x\"),3,IF(H17=\"x\",2,1)))","v":0},null,null,null,null,{"$f":"IF(AND(NOT(C17=\"\"),NOT(R17=\"\"),NOT(N19=\"\"),S19=\"\"),1,\"\")","v":""}]
[null,3,null,null,null,null,null,null,null,null,null,null,null,{"$f":"IF(AND(Y20=\"\",Z20=\"\",NOT(C20=\"\")),IF(M20=\"\",\"24:00\"-L20,M20-L20),\"\")","v":""},null,{"$f":"IF(AR20=0,\"\",IF(I20=\"x\",O20*$Z$10,0))","v":""},null,null,null,{"$f":"IF(OR(AJ20=\"X\",AR20=0),\"\",AJ20-(IF(S20=\"X\",4.8,0)))","v":""},null,null,null,{"$f":"COUNT(N20:N22)","v":0},{"$f":"IF(OR(C20=\"\",NOT(L20=\"\")),\"\",\"Zeiten ?\")","v":""},{"$f":"IF(OR(C20=\"\",COUNTA(L20:L22)=COUNT(M20:M22)),\"\",\"Zeiten ?\")","v":""},{"$f":"IF(AND(Y20=\"\",Z20=\"\"),0,IF(AND(NOT(Y20=\"\"),NOT(Z20=\"\")),2,1))","v":0},null,0,0,0,0,0,0,0,{"$f":"VLOOKUP(AI20,$AL$14:$AM$22,2)","v":"X"},null,6,14,null,{"$f":"IF(C20=\"\",0,IF(OR(F20=\"x\",G20=\"x\"),3,IF(H20=\"x\",2,1)))","v":0},0,0,{"$f":"IF(AND(AQ20=0,AO20>1),1,0)","v":0}]
[null,null,null,null,null,null,null,null,null,null,null,null,null,{"$f":"IF(AND(Y20=\"\",Z20=\"\",NOT(C20=\"\")),IF(AND(M21=\"\",COUNTA(M22)>0),\"24:00\"-L21,IF((M21-L21)=0,\"\",M21-L21)),\"\")","v":""},null,null,null,null,null,{"$f":"IF(OR(AJ21=\"X\",AR20=0),\"\",AJ21-(IF(AND(S21=\"X\",AJ21-$AJ$10>0),$AJ$10,0)))","v":""},null,null,null,null,null,null,null,null,0,0,0,0,0,0,0,"X",null,7,20,null,{"$f":"IF(C20=\"\",0,IF(OR(F20=\"x\",G20=\"x\"),3,IF(H20=\"x\",2,1)))","v":0},null,null,null,null,{"$f":"IF(AND(NOT(C20=\"\"),NOT(R20=\"\"),NOT(N21=\"\"),S21=\"\"),1,\"\")","v":""}]
[null,null,null,null,null,null,null,null,null,null,null,null,null,{"$f":"IF(AND(Y20=\"\",Z20=\"\",NOT(C20=\"\")),IF((M22-L22)=0,\"\",M22-L22),\"\")","v":""},null,null,null,null,null,{"$f":"IF(OR(AJ22=\"X\",AR20=0),\"\",AJ22-(IF(AND(S22=\"X\",AJ22-$AJ$10>0),$AJ$10,0)))","v":""},{"$f":"IF(OR(C20=\"\",AQ20=1),\"\",IF(X20=1,SUM(P20:Q20,T20),SUM(P20:R20,T20:T22)))","v":""},null,null,null,null,null,null,null,0,0,0,0,0,0,0,"X",null,8,24,null,{"$f":"IF(C20=\"\",0,IF(OR(F20=\"x\",G20=\"x\"),3,IF(H20=\"x\",2,1)))","v":0},null,null,null,null,{"$f":"IF(AND(NOT(C20=\"\"),NOT(R20=\"\"),NOT(N22=\"\"),S22=\"\"),1,\"\")","v":""}]
[null,4,null,null,null,null,null,null,null,null,null,null,null,{"$f":"IF(AND(Y23=\"\",Z23=\"\",NOT(C23=\"\")),IF(M23=\"\",\"24:00\"-L23,M23-L23),\"\")","v":""},null,{"$f":"IF(AR23=0,\"\",IF(I23=\"x\",O23*$Z$10,0))","v":""},null,null,null,{"$f":"IF(OR(AJ23=\"X\",AR23=0),\"\",AJ23-(IF(S23=\"X\",4.8,0)))","v":""},null,null,null,{"$f":"COUNT(N23:N25)","v":0},{"$f":"IF(OR(C23=\"\",NOT(L23=\"\")),\"\",\"Zeiten ?\")","v":""},{"$f":"IF(OR(C23=\"\",COUNTA(L23:L25)=COUNT(M23:M25)),\"\",\"Zeiten ?\")","v":""},{"$f":"IF(AND(Y23=\"\",Z23=\"\"),0,IF(AND(NOT(Y23=\"\"),NOT(Z23=\"\")),2,1))","v":0},null,0,0,0,0,0,0,0,{"$f":"VLOOKUP(AI23,$AL$14:$AM$22,2)","v":"X"},null,null,null,null,{"$f":"IF(C23=\"\",0,IF(OR(F23=\"x\",G23=\"x\"),3,IF(H23=\"x\",2,1)))","v":0},0,0,{"$f":"IF(AND(AQ23=0,AO23>1),1,0)","v":0}]
[null,null,null,null,null,null,null,null,null,null,null,null,null,{"$f":"IF(AND(Y23=\"\",Z23=\"\",NOT(C23=\"\")),IF(AND(M24=\"\",COUNTA(M25)>0),\"24:00\"-L24,IF((M24-L24)=0,\"\",M24-L24)),\"\")","v":""},null,null,null,null,null,{"$f":"IF(OR(AJ24=\"X\",AR23=0),\"\",AJ24-(IF(AND(S24=\"X\",AJ24-$AJ$10>0),$AJ$10,0)))","v":""},null,null,null,null,null,null,null,null,0,0,0,0,0,0,0,"X",null,null,null,null,{"$f":"IF(C23=\"\",0,IF(OR(F23=\"x\",G23=\"x\"),3,IF(H23=\"x\",2,1)))","v":0},null,null,null,null,{"$f":"IF(AND(NOT(C23=\"\"),NOT(R23=\"\"),NOT(N24=\"\"),S24=\"\"),1,\"\")","v":""}]
[null,null,null,null,null,null,null,null,null,null,null,null,null,{"$f":"IF(AND(Y23=\"\",Z23=\"\",NOT(C23=\"\")),IF((M25-L25)=0,\"\",M25-L25),\"\")","v":""},null,null,null,null,null,{"$f":"IF(OR(AJ25=\"X\",AR23=0),\"\",AJ25-(IF(AND(S25=\"X\",AJ25-$AJ$10>0),$AJ$10,0)))","v":""},{"$f":"IF(OR(C23=\"\",AQ23=1),\"\",IF(X23=1,SUM(P23:Q23,T23),SUM(P23:R23,T23:T25)))","v":""},null,null,null,null,null,null,null,0,0,0,0,0,0,0,"X",null,null,null,null,{"$f":"IF(C23=\"\",0,IF(OR(F23=\"x\",G23=\"x\"),3,IF(H23=\"x\",2,1)))","v":0},null,null,null,null,{"$f":"IF(AND(NOT(C23=\"\"),NOT(R23=\"\"),NOT(N25=\"\"),S25=\"\"),1,\"\")","v":""}]
[null,5,null,null,null,null,null,null,null,null,null,null,null,{"$f":"IF(AND(Y26=\"\",Z26=\"\",NOT(C26=\"\")),IF(M26=\"\",\"24:00\"-L26,M26-L26),\"\")","v":""},null,{"$f":"IF(AR26=0,\"\",IF(I26=\"x\",O26*$Z$10,0))","v":""},null,null,null,{"$f":"IF(OR(AJ26=\"X\",AR26=0),\"\",AJ26-(IF(S26=\"X\",4.8,0)))","v":""},null,null,null,{"$f":"COUNT(N26:N27)","v":0},{"$f":"IF(OR(C26=\"\",NOT(L26=\"\")),\"\",\"Zeiten ?\")","v":""},{"$f":"IF(OR(C26=\"\",COUNTA(L26:L27)=COUNT(M26:M27)),\"\",\"Zeiten ?\")","v":""},{"$f":"IF(AND(Y26=\"\",Z26=\"\"),0,IF(AND(NOT(Y26=\"\"),NOT(Z26=\"\")),2,1))","v":0},null,0,0,0,0,0,0,0,{"$f":"VLOOKUP(AI26,$AL$14:$AM$22,2)","v":"X"},null,null,null,null,{"$f":"IF(C26=\"\",0,IF(OR(F26=\"x\",G26=\"x\"),3,IF(H26=\"x\",2,1)))","v":0},0,0,{"$f":"IF(AND(AQ26=0,AO26>1),1,0)","v":0}]
[null,null,null,null,null,null,null,null,null,null,null,null,null,{"$f":"IF(AND(Y26=\"\",Z26=\"\",NOT(C26=\"\")),IF((M27-L27)=0,\"\",M27-L27),\"\")","v":""},null,null,null,null,null,{"$f":"IF(OR(AJ27=\"X\",AR26=0),\"\",AJ27-(IF(AND(S27=\"X\",AJ27-$AJ$10>0),$AJ$10,0)))","v":""},{"$f":"IF(OR(C26=\"\",AQ26=1),\"\",IF(X26=1,SUM(P26:Q26,T26),SUM(P26:R26,T26:T27)))","v":""},null,null,null,null,null,null,null,0,0,0,0,0,0,0,"X",null,null,null,null,{"$f":"IF(C26=\"\",0,IF(OR(F26=\"x\",G26=\"x\"),3,IF(H26=\"x\",2,1)))","v":0},null,null,null,null,{"$f":"IF(AND(NOT(C26=\"\"),NOT(R26=\"\"),NOT(N27=\"\"),S27=\"\"),1,\"\")","v":""}]
[null,6,null,null,null,null,null,null,null,null,null,null,null,{"$f":"IF(AND(Y28=\"\",Z28=\"\",NOT(C28=\"\")),IF(M28=\"\",\"24:00\"-L28,M28-L28),\"\")","v":""},null,{"$f":"IF(AR28=0,\"\",IF(I28=\"x\",O28*$Z$10,0))","v":""},null,null,null,{"$f":"IF(OR(AJ28=\"X\",AR28=0),\"\",AJ28-(IF(S28=\"X\",4.8,0)))","v":""},null,null,null,{"$f":"COUNT(N28:N29)","v":0},{"$f":"IF(OR(C28=\"\",NOT(L28=\"\")),\"\",\"Zeiten ?\")","v":""},{"$f":"IF(OR(C28=\"\",COUNTA(L28:L29)=COUNT(M28:M29)),\"\",\"Zeiten ?\")","v":""},{"$f":"IF(AND(Y28=\"\",Z28=\"\"),0,IF(AND(NOT(Y28=\"\"),NOT(Z28=\"\")),2,1))","v":0},null,0,0,0,0,0,0,0,{"$f":"VLOOKUP(AI28,$AL$14:$AM$22,2)","v":"X"},null,null,null,null,{"$f":"IF(C28=\"\",0,IF(OR(F28=\"x\",G28=\"x\"),3,IF(H28=\"x\",2,1)))","v":0},0,0,{"$f":"IF(AND(AQ28=0,AO28>1),1,0)","v":0}]
[null,null,null,null,null,null,null,null,null,null,null,null,null,{"$f":"IF(AND(Y28=\"\",Z28=\"\",NOT(C28=\"\")),IF((M29-L29)=0,\"\",M29-L29),\"\")","v":""},null,null,null,null,null,{"$f":"IF(OR(AJ29=\"X\",AR28=0),\"\",AJ29-(IF(AND(S29=\"X\",AJ29-$AJ$10>0),$AJ$10,0)))","v":""},{"$f":"IF(OR(C28=\"\",AQ28=1),\"\",IF(X28=1,SUM(P28:Q28,T28),SUM(P28:R28,T28:T29)))","v":""},null,null,null,null,null,null,null,0,0,0,0,0,0,0,"X",null,null,null,null,{"$f":"IF(C28=\"\",0,IF(OR(F28=\"x\",G28=\"x\"),3,IF(H28=\"x\",2,1)))","v":0},null,null,null,null,{"$f":"IF(AND(NOT(C28=\"\"),NOT(R28=\"\"),NOT(N29=\"\"),S29=\"\"),1,\"\")","v":""}]
[null,7,null,null,null,null,null,null,null,null,null,null,null,{"$f":"IF(AND(Y30=\"\",Z30=\"\",NOT(C30=\"\")),IF(M30=\"\",\"24:00\"-L30,M30-L30),\"\")","v":""},null,{"$f":"IF(AR30=0,\"\",IF(I30=\"x\",O30*$Z$10,0))","v":""},null,null,null,{"$f":"IF(OR(AJ30=\"X\",AR30=0),\"\",AJ30-(IF(S30=\"X\",4.8,0)))","v":""},null,null,null,{"$f":"COUNT(N30:N31)","v":0},{"$f":"IF(OR(C30=\"\",NOT(L30=\"\")),\"\",\"Zeiten ?\")","v":""},{"$f":"IF(OR(C30=\"\",COUNTA(L30:L31)=COUNT(M30:M31)),\"\",\"Zeiten ?\")","v":""},{"$f":"IF(AND(Y30=\"\",Z30=\"\"),0,IF(AND(NOT(Y30=\"\"),NOT(Z30=\"\")),2,1))","v":0},null,{"$f":"IF(J30=\"x\",1,0)","v":0},0,0,0,0,0,{"$f":"SUM(AD30:AH30)","v":0},{"$f":"VLOOKUP(AI30,$AL$14:$AM$22,2)","v":"X"},null,null,null,null,{"$f":"IF(C30=\"\",0,IF(OR(F30=\"x\",G30=\"x\"),3,IF(H30=\"x\",2,1)))","v":0},0,0,{"$f":"IF(AND(AQ30=0,AO30>1),1,0)","v":0}]
[null,null,null,null,null,null,null,null,null,null,null,null,null,{"$f":"IF(AND(Y30=\"\",Z30=\"\",NOT(C30=\"\")),IF((M31-L31)=0,\"\",M31-L31),\"\")","v":""},null,null,null,null,null,{"$f":"IF(OR(AJ31=\"X\",AR30=0),\"\",AJ31-(IF(AND(S31=\"X\",AJ31-$AJ$10>0),$AJ$10,0)))","v":""},{"$f":"IF(OR(C30=\"\",AQ30=1),\"\",IF(X30=1,SUM(P30:Q30,T30),SUM(P30:R30,T30:T31)))","v":""},null,null,null,null,null,null,null,0,0,0,0,0,0,0,"X",null,null,null,null,{"$f":"IF(C30=\"\",0,IF(OR(F30=\"x\",G30=\"x\"),3,IF(H30=\"x\",2,1)))","v":0},null,null,null,null,{"$f":"IF(AND(NOT(C30=\"\"),NOT(R30=\"\"),NOT(N31=\"\"),S31=\"\"),1,\"\")","v":""}]
[null,8,null,null,null,null,null,null,null,null,null,null,null,{"$f":"IF(AND(Y32=\"\",Z32=\"\",NOT(C32=\"\")),IF(M32=\"\",\"24:00\"-L32,M32-L32),\"\")","v":""},null,{"$f":"IF(AR32=0,\"\",IF(I32=\"x\",O32*$Z$10,0))","v":""},null,null,null,{"$f":"IF(OR(AJ32=\"X\",AR32=0),\"\",AJ32-(IF(S32=\"X\",4.8,0)))","v":""},null,null,null,{"$f":"COUNT(N32:N33)","v":0},{"$f":"IF(OR(C32=\"\",NOT(L32=\"\")),\"\",\"Zeiten ?\")","v":""},{"$f":"IF(OR(C32=\"\",COUNTA(L32:L33)=COUNT(M32:M33)),\"\",\"Zeiten ?\")","v":""},{"$f":"IF(AND(Y32=\"\",Z32=\"\"),0,IF(AND(NOT(Y32=\"\"),NOT(Z32=\"\")),2,1))","v":0},null,0,0,0,0,0,0,0,"X",null,null,null,null,{"$f":"IF(C32=\"\",0,IF(OR(F32=\"x\",G32=\"x\"),3,IF(H32=\"x\",2,1)))","v":0},0,0,{"$f":"IF(AND(AQ32=0,AO32>1),1,0)","v":0}]
[null,null,null,null,null,null,null,null,null,null,null,null,null,{"$f":"IF(AND(Y32=\"\",Z32=\"\",NOT(C32=\"\")),IF((M33-L33)=0,\"\",M33-L33),\"\")","v":""},null,null,null,null,null,{"$f":"IF(OR(AJ33=\"X\",AR32=0),\"\",AJ33-(IF(AND(S33=\"X\",AJ33-$AJ$10>0),$AJ$10,0)))","v":""},{"$f":"IF(OR(C32=\"\",AQ32=1),\"\",IF(X32=1,SUM(P32:Q32,T32),SUM(P32:R32,T32:T33)))","v":""},null,null,null,null,null,null,null,0,0,0,0,0,0,0,"X",null,null,null,null,{"$f":"IF(C32=\"\",0,IF(OR(F32=\"x\",G32=\"x\"),3,IF(H32=\"x\",2,1)))","v":0},null,null,null,null,""]
[null,9,null,null,null,null,null,null,null,null,null,null,null,{"$f":"IF(AND(Y34=\"\",Z34=\"\",NOT(C34=\"\")),IF(M34=\"\",\"24:00\"-L34,M34-L34),\"\")","v":""},null,{"$f":"IF(AR34=0,\"\",IF(I34=\"x\",O34*$Z$10,0))","v":""},null,null,null,{"$f":"IF(OR(AJ34=\"X\",AR34=0),\"\",AJ34-(IF(S34=\"X\",4.8,0)))","v":""},null,null,null,{"$f":"COUNT(N34:N35)","v":0},{"$f":"IF(OR(C34=\"\",NOT(L34=\"\")),\"\",\"Zeiten ?\")","v":""},{"$f":"IF(OR(C34=\"\",COUNTA(L34:L35)=COUNT(M34:M35)),\"\",\"Zeiten ?\")","v":""},{"$f":"IF(AND(Y34=\"\",Z34=\"\"),0,IF(AND(NOT(Y34=\"\"),NOT(Z34=\"\")),2,1))","v":0},null,0,0,0,0,0,0,0,"X",null,null,null,null,{"$f":"IF(C34=\"\",0,IF(OR(F34=\"x\",G34=\"x\"),3,IF(H34=\"x\",2,1)))","v":0},0,0,{"$f":"IF(AND(AQ34=0,AO34>1),1,0)","v":0}]
[null,null,null,null,null,null,null,null,null,null,null,null,null,{"$f":"IF(AND(Y34=\"\",Z34=\"\",NOT(C34=\"\")),IF((M35-L35)=0,\"\",M35-L35),\"\")","v":""},null,null,null,null,null,{"$f":"IF(OR(AJ35=\"X\",AR34=0),\"\",AJ35-(IF(AND(S35=\"X\",AJ35-$AJ$10>0),$AJ$10,0)))","v":""},{"$f":"IF(OR(C34=\"\",AQ34=1),\"\",IF(X34=1,SUM(P34:Q34,T34),SUM(P34:R34,T34:T35)))","v":""},null,null,null,null,null,null,null,0,0,0,0,0,0,0,"X",null,null,null,null,{"$f":"IF(C34=\"\",0,IF(OR(F34=\"x\",G34=\"x\"),3,IF(H34=\"x\",2,1)))","v":0},null,null,null,null,""]
[null,10,null,null,null,null,null,null,null,null,null,null,null,{"$f":"IF(AND(Y36=\"\",Z36=\"\",NOT(C36=\"\")),IF(M36=\"\",\"24:00\"-L36,M36-L36),\"\")","v":""},null,{"$f":"IF(AR36=0,\"\",IF(I36=\"x\",O36*$Z$10,0))","v":""},null,null,null,{"$f":"IF(OR(AJ36=\"X\",AR36=0),\"\",AJ36-(IF(S36=\"X\",4.8,0)))","v":""},null,null,null,{"$f":"COUNT(N36:N37)","v":0},{"$f":"IF(OR(C36=\"\",NOT(L36=\"\")),\"\",\"Zeiten ?\")","v":""},{"$f":"IF(OR(C36=\"\",COUNTA(L36:L37)=COUNT(M36:M37)),\"\",\"Zeiten ?\")","v":""},{"$f":"IF(AND(Y36=\"\",Z36=\"\"),0,IF(AND(NOT(Y36=\"\"),NOT(Z36=\"\")),2,1))","v":0},null,0,0,0,0,0,0,0,"X",null,null,null,null,{"$f":"AO37","v":0},0,0,{"$f":"IF(AND(AQ36=0,AO36>1),1,0)","v":0}]
[null,null,null,null,null,null,null,null,null,null,null,null,null,{"$f":"IF(AND(Y36=\"\",Z36=\"\",NOT(C36=\"\")),IF((M37-L37)=0,\"\",M37-L37),\"\")","v":""},null,null,null,null,null,{"$f":"IF(OR(AJ37=\"X\",AR36=0),\"\",AJ37-(IF(AND(S37=\"X\",AJ37-$AJ$10>0),$AJ$10,0)))","v":""},{"$f":"IF(OR(C36=\"\",AQ36=1),\"\",IF(X36=1,SUM(P36:Q36,T36),SUM(P36:R36,T36:T37)))","v":""},null,null,null,null,null,null,null,0,0,0,0,0,0,0,"X",null,null,null,null,{"$f":"IF(C36=\"\",0,IF(OR(F36=\"x\",G36=\"x\"),3,IF(H36=\"x\",2,1)))","v":0},null,null,null,null,""]
[null,11,null,null,null,null,null,null,null,null,null,null,null,{"$f":"IF(AND(Y38=\"\",Z38=\"\",NOT(C38=\"\")),IF(M38=\"\",\"24:00\"-L38,M38-L38),\"\")","v":""},null,{"$f":"IF(AR38=0,\"\",IF(I38=\"x\",O38*$Z$10,0))","v":""},null,null,null,{"$f":"IF(OR(AJ38=\"X\",AR38=0),\"\",AJ38-(IF(S38=\"X\",4.8,0)))","v":""},null,null,null,{"$f":"COUNT(N38:N39)","v":0},{"$f":"IF(OR(C38=\"\",NOT(L38=\"\")),\"\",\"Zeiten ?\")","v":""},{"$f":"IF(OR(C38=\"\",COUNTA(L38:L39)=COUNT(M38:M39)),\"\",\"Zeiten ?\")","v":""},{"$f":"IF(AND(Y38=\"\",Z38=\"\"),0,IF(AND(NOT(Y38=\"\"),NOT(Z38=\"\")),2,1))","v":0},null,0,0,0,0,0,0,0,{"$f":"VLOOKUP(AI38,$AL$14:$AM$22,2)","v":"X"},null,null,null,null,{"$f":"IF(C38=\"\",0,IF(OR(F38=\"x\",G38=\"x\"),3,IF(H38=\"x\",2,1)))","v":0},0,0,{"$f":"IF(AND(AQ38=0,AO38>1),1,0)","v":0}]
[null,null,null,null,null,null,null,null,null,null,null,null,null,{"$f":"IF(AND(Y38=\"\",Z38=\"\",NOT(C38=\"\")),IF((M39-L39)=0,\"\",M39-L39),\"\")","v":""},null,null,null,null,null,{"$f":"IF(OR(AJ39=\"X\",AR38=0),\"\",AJ39-(IF(AND(S39=\"X\",AJ39-$AJ$10>0),$AJ$10,0)))","v":""},{"$f":"IF(OR(C38=\"\",AQ38=1),\"\",IF(X38=1,SUM(P38:Q38,T38),SUM(P38:R38,T38:T39)))","v":""},null,null,null,null,null,null,null,0,0,0,0,0,0,0,"X",null,null,null,null,{"$f":"IF(C38=\"\",0,IF(OR(F38=\"x\",G38=\"x\"),3,IF(H38=\"x\",2,1)))","v":0},null,null,null,null,""]
[null,12,null,null,null,null,null,null,null,null,null,null,null,{"$f":"IF(AND(Y40=\"\",Z40=\"\",NOT(C40=\"\")),IF(M40=\"\",\"24:00\"-L40,M40-L40),\"\")","v":""},null,{"$f":"IF(AR40=0,\"\",IF(I40=\"x\",O40*$Z$10,0))","v":""},null,null,null,{"$f":"IF(OR(AJ40=\"X\",AR40=0),\"\",AJ40-(IF(S40=\"X\",4.8,0)))","v":""},null,null,null,{"$f":"COUNT(N40:N41)","v":0},{"$f":"IF(OR(C40=\"\",NOT(L40=\"\")),\"\",\"Zeiten ?\")","v":""},{"$f":"IF(OR(C40=\"\",COUNTA(L40:L41)=COUNT(M40:M41)),\"\",\"Zeiten ?\")","v":""},{"$f":"IF(AND(Y40=\"\",Z40=\"\"),0,IF(AND(NOT(Y40=\"\"),NOT(Z40=\"\")),2,1))","v":0},null,0,0,0,0,0,0,0,{"$f":"VLOOKUP(AI40,$AL$14:$AM$22,2)","v":"X"},null,null,null,null,{"$f":"IF(C40=\"\",0,IF(OR(F40=\"x\",G40=\"x\"),3,IF(H40=\"x\",2,1)))","v":0},0,0,{"$f":"IF(AND(AQ40=0,AO40>1),1,0)","v":0}]
[null,null,null,null,null,null,null,null,null,null,null,null,null,{"$f":"IF(AND(Y40=\"\",Z40=\"\",NOT(C40=\"\")),IF((M41-L41)=0,\"\",M41-L41),\"\")","v":""},null,null,null,null,null,{"$f":"IF(OR(AJ41=\"X\",AR40=0),\"\",AJ41-(IF(AND(S41=\"X\",AJ41-$AJ$10>0),$AJ$10,0)))","v":""},{"$f":"IF(OR(C40=\"\",AQ40=1),\"\",IF(X40=1,SUM(P40:Q40,T40),SUM(P40:R40,T40:T41)))","v":""},null,null,null,null,null,null,null,0,0,0,0,0,0,0,"X",null,null,null,null,{"$f":"IF(C40=\"\",0,IF(OR(F40=\"x\",G40=\"x\"),3,IF(H40=\"x\",2,1)))","v":0},null,null,null,null,""]
[null,13,null,null,null,null,null,null,null,null,null,null,null,{"$f":"IF(AND(Y42=\"\",Z42=\"\",NOT(C42=\"\")),IF(M42=\"\",\"24:00\"-L42,M42-L42),\"\")","v":""},null,{"$f":"IF(AR42=0,\"\",IF(I42=\"x\",O42*$Z$10,0))","v":""},null,null,null,{"$f":"IF(OR(AJ42=\"X\",AR42=0),\"\",AJ42-(IF(S42=\"X\",4.8,0)))","v":""},null,null,null,{"$f":"COUNT(N42:N43)","v":0},{"$f":"IF(OR(C42=\"\",NOT(L42=\"\")),\"\",\"Zeiten ?\")","v":""},{"$f":"IF(OR(C42=\"\",COUNTA(L42:L43)=COUNT(M42:M43)),\"\",\"Zeiten ?\")","v":""},{"$f":"IF(AND(Y42=\"\",Z42=\"\"),0,IF(AND(NOT(Y42=\"\"),NOT(Z42=\"\")),2,1))","v":0},null,0,0,0,0,0,0,0,{"$f":"VLOOKUP(AI42,$AL$14:$AM$22,2)","v":"X"},null,null,null,null,{"$f":"IF(C42=\"\",0,IF(OR(F42=\"x\",G42=\"x\"),3,IF(H42=\"x\",2,1)))","v":0},0,0,{"$f":"IF(AND(AQ42=0,AO42>1),1,0)","v":0}]
[null,null,null,null,null,null,null,null,null,null,null,null,null,{"$f":"IF(AND(Y42=\"\",Z42=\"\",NOT(C42=\"\")),IF((M43-L43)=0,\"\",M43-L43),\"\")","v":""},null,null,null,null,null,{"$f":"IF(OR(AJ43=\"X\",AR42=0),\"\",AJ43-(IF(AND(S43=\"X\",AJ43-$AJ$10>0),$AJ$10,0)))","v":""},{"$f":"IF(OR(C42=\"\",AQ42=1),\"\",IF(X42=1,SUM(P42:Q42,T42),SUM(P42:R42,T42:T43)))","v":""},null,null,null,null,null,null,null,0,0,0,0,0,0,0,"X",null,null,null,null,{"$f":"IF(C42=\"\",0,IF(OR(F42=\"x\",G42=\"x\"),3,IF(H42=\"x\",2,1)))","v":0},null,null,null,null,""]
[null,14,null,null,null,null,null,null,null,null,null,null,null,{"$f":"IF(AND(Y44=\"\",Z44=\"\",NOT(C44=\"\")),IF(M44=\"\",\"24:00\"-L44,M44-L44),\"\")","v":""},null,{"$f":"IF(AR44=0,\"\",IF(I44=\"x\",O44*$Z$10,0))","v":""},null,null,null,{"$f":"IF(OR(AJ44=\"X\",AR44=0),\"\",AJ44-(IF(S44=\"X\",4.8,0)))","v":""},null,null,null,{"$f":"COUNT(N44:N45)","v":0},{"$f":"IF(OR(C44=\"\",NOT(L44=\"\")),\"\",\"Zeiten ?\")","v":""},{"$f":"IF(OR(C44=\"\",COUNTA(L44:L45)=COUNT(M44:M45)),\"\",\"Zeiten ?\")","v":""},{"$f":"IF(AND(Y44=\"\",Z44=\"\"),0,IF(AND(NOT(Y44=\"\"),NOT(Z44=\"\")),2,1))","v":0},null,{"$f":"IF(J44=\"x\",1,0)","v":0},0,0,0,0,0,{"$f":"SUM(AD44:AH44)","v":0},{"$f":"VLOOKUP(AI44,$AL$14:$AM$22,2)","v":"X"},null,null,null,null,{"$f":"IF(C44=\"\",0,IF(OR(F44=\"x\",G44=\"x\"),3,IF(H44=\"x\",2,1)))","v":0},0,0,{"$f":"IF(AND(AQ44=0,AO44>1),1,0)","v":0}]
[null,null,null,null,null,null,null,null,null,null,null,null,null,{"$f":"IF(AND(Y44=\"\",Z44=\"\",NOT(C44=\"\")),IF((M45-L45)=0,\"\",M45-L45),\"\")","v":""},null,null,null,null,null,{"$f":"IF(OR(AJ45=\"X\",AR44=0),\"\",AJ45-(IF(AND(S45=\"X\",AJ45-$AJ$10>0),$AJ$10,0)))","v":""},{"$f":"IF(OR(C44=\"\",AQ44=1),\"\",IF(X44=1,SUM(P44:Q44,T44),SUM(P44:R44,T44:T45)))","v":""},null,null,null,null,null,null,null,{"$f":"IF(J45=\"x\",1,0)","v":0},0,0,0,0,0,{"$f":"SUM(AD45:AH45)","v":0},{"$f":"VLOOKUP(AI45,$AL$14:$AM$22,2)","v":"X"},null,null,null,null,{"$f":"IF(C44=\"\",0,IF(OR(F44=\"x\",G44=\"x\"),3,IF(H44=\"x\",2,1)))","v":0},null,null,null,null,""]
[null,15,null,null,null,null,null,null,null,null,null,null,null,{"$f":"IF(AND(Y46=\"\",Z46=\"\",NOT(C46=\"\")),IF(M46=\"\",\"24:00\"-L46,M46-L46),\"\")","v":""},null,{"$f":"IF(AR46=0,\"\",IF(I46=\"x\",O46*$Z$10,0))","v":""},null,null,null,{"$f":"IF(OR(AJ46=\"X\",AR46=0),\"\",AJ46)","v":""},{"$f":"IF(OR(C46=\"\",AQ46=1),\"\",SUM(P46:Q46,T46))","v":""},null,null,{"$f":"COUNT(N46)","v":0},{"$f":"IF(OR(C46=\"\",NOT(L46=\"\")),\"\",\"Zeiten ?\")","v":""},{"$f":"IF(C46=\"\",\"\",IF(AND(NOT(L46=\"\"),NOT(M46=\"\")),IF(M46-L46<0,\"Zeit negativ\",\"\"),\"Zeit fehlt\"))","v":""},{"$f":"IF(AND(Y46=\"\",Z46=\"\"),0,IF(AND(NOT(Y46=\"\"),NOT(Z46=\"\")),2,1))","v":0},null,0,0,0,0,0,0,0,{"$f":"VLOOKUP(AI46,$AL$14:$AM$22,2)","v":"X"},null,null,null,null,{"$f":"IF(C46=\"\",0,IF(OR(F46=\"x\",G46=\"x\"),3,IF(H46=\"x\",2,1)))","v":0},0,0,{"$f":"IF(AND(AQ46=0,AO46>1),1,0)","v":0}]
[null,16,null,null,null,null,null,null,null,null,null,null,null,{"$f":"IF(AND(Y47=\"\",Z47=\"\",NOT(C47=\"\")),IF(M47=\"\",\"24:00\"-L47,M47-L47),\"\")","v":""},null,{"$f":"IF(AR47=0,\"\",IF(I47=\"x\",O47*$Z$10,0))","v":""},null,null,null,{"$f":"IF(OR(AJ47=\"X\",AR47=0),\"\",AJ47)","v":""},{"$f":"IF(OR(C47=\"\",AQ47=1),\"\",SUM(P47:Q47,T47))","v":""},null,null,{"$f":"COUNT(N47)","v":0},{"$f":"IF(OR(C47=\"\",NOT(L47=\"\")),\"\",\"Zeiten ?\")","v":""},{"$f":"IF(C47=\"\",\"\",IF(AND(NOT(L47=\"\"),NOT(M47=\"\")),IF(M47-L47<0,\"Zeit negativ\",\"\"),\"Zeit fehlt\"))","v":""},{"$f":"IF(AND(Y47=\"\",Z47=\"\"),0,IF(AND(NOT(Y47=\"\"),NOT(Z47=\"\")),2,1))","v":0},null,{"$f":"IF(J47=\"x\",1,0)","v":0},0,0,0,0,0,{"$f":"SUM(AD47:AH47)","v":0},"X",null,null,null,null,0,0,0,{"$f":"IF(AND(AQ47=0,AO47>1),1,0)","v":0}]
[null,17,null,null,null,null,null,null,null,null,null,null,null,"",null,"",null,null,null,"",{"$f":"IF(OR(C48=\"\",AQ48=1),\"\",SUM(P48:Q48,T48))","v":""},null,null,0,"","",0,null,0,0,0,0,0,0,0,"X",null,null,null,null,0,0,0,0]
[null,18,null,null,null,null,null,null,null,null,null,null,null,"",null,"",null,null,null,"","",null,null,0,"","",0,null,0,0,0,0,0,0,0,"X",null,null,null,null,0,0,0,0]
[null,19,null,null,null,null,null,null,null,null,null,null,null,"",null,"",null,null,null,"","",null,null,0,"","",0,null,0,0,0,0,0,0,0,"X",null,null,null,null,0,0,0,0]
[null,20,null,null,null,null,null,null,null,null,null,null,null,"",null,"",null,null,null,"","",null,null,0,"","",0,null,0,0,0,0,0,0,0,"X",null,null,null,null,0,0,0,0]
[null,21,null,null,null,null,null,null,null,null,null,null,null,"",null,"",null,null,null,"","",null,null,0,"","",0,null,0,0,0,0,0,0,0,"X",null,null,null,null,0,0,0,0]
[null,22,null,null,null,null,null,null,null,null,null,null,null,"",null,"",null,null,null,"","",null,null,0,"","",0,null,0,0,0,0,0,0,0,"X",null,null,null,null,0,0,0,0]
[null,23,null,null,null,null,null,null,null,null,null,null,null,"",null,"",null,null,null,"","",null,null,0,"","",0,null,0,0,0,0,0,0,0,"X",null,null,null,null,0,0,0,0]
[null,24,null,null,null,null,null,null,null,null,null,null,null,"",null,"",null,null,null,"","",null,null,0,"","",{"$f":"IF(AND(Y55=\"\",Z55=\"\"),0,IF(AND(NOT(Y55=\"\"),NOT(Z55=\"\")),2,1))","v":0},null,0,0,0,0,0,0,0,"X",null,null,null,null,0,0,0,0]
[null,25,null,null,null,null,null,null,null,null,null,null,null,"",null,"",null,null,null,"","",null,null,0,"","",0,null,0,0,0,0,0,0,0,"X",null,null,null,null,0,0,0,0]
[null,26,null,null,null,null,null,null,null,null,null,null,null,"",null,"",null,null,null,"","",null,null,0,"","",0,null,0,0,0,0,0,0,0,"X",null,null,null,null,0,0,0,0]
[null,27,null,null,null,null,null,null,null,null,null,null,null,"",null,"",null,null,null,"","",null,null,0,"","",0,null,0,0,0,0,0,0,0,"X",null,null,null,null,0,0,0,0]
[null,28,null,null,null,null,null,null,null,null,null,null,null,"",null,"",null,null,null,"","",null,null,0,"","",0,null,0,0,0,0,0,0,0,"X",null,null,null,null,0,0,0,0]
[null,29,null,null,null,null,null,null,null,null,null,null,null,"",null,"",null,null,null,"","",null,null,0,"","",0,null,0,0,0,0,0,0,0,"X",null,null,null,null,0,0,0,0]
[null,30,null,null,null,null,null,null,null,null,null,null,null,"",null,"",null,null,null,"","",null,null,0,"","",0,null,0,0,0,0,0,0,0,"X",null,null,null,null,0,0,0,0]
[null,31,null,null,null,null,null,null,null,null,null,null,null,"",null,"",null,null,null,"","",null,null,0,"","",0,null,0,0,0,0,0,0,0,"X",null,null,null,null,0,0,0,0]
[null,32,null,null,null,null,null,null,null,null,null,null,null,"",null,"",null,null,null,"","",null,null,0,"","",0,null,0,0,0,0,0,0,0,"X",null,null,null,null,0,0,0,0]
[null,33,null,null,null,null,null,null,null,null,null,null,null,"",null,"",null,null,null,"","",null,null,0,"","",0,null,0,0,0,0,0,0,0,"X",null,null,null,null,0,0,0,0]
[null,34,null,null,null,null,null,null,null,null,null,null,null,"",null,"",null,null,null,"","",null,null,0,"","",0,null,0,0,0,0,0,0,0,"X",null,null,null,null,0,0,0,0]
[null,35,null,null,null,null,null,null,null,null,null,null,null,"",null,"",null,null,null,"","",null,null,0,"","",0,null,0,0,0,0,0,0,0,"X",null,null,null,null,0,0,0,0]
[null,36,null,null,null,null,null,null,null,null,null,null,null,"",null,"",null,null,null,"","",null,null,0,"","",0,null,0,0,0,0,0,0,0,"X",null,null,null,null,0,0,0,0]
[null,37,null,null,null,null,null,null,null,null,null,null,null,"",null,"",null,null,null,"","",null,null,0,"","",0,null,0,0,0,0,0,0,0,"X",null,null,null,null,0,0,0,0]
[null,38,null,null,null,null,null,null,null,null,null,null,null,"",null,"",null,null,null,"","",null,null,0,"","",0,null,0,0,0,0,0,0,0,"X",null,null,null,null,0,0,0,0]
[null,39,null,null,null,null,null,null,null,null,null,null,null,"",null,"",null,null,null,"","",null,null,0,"","",0,null,0,0,0,0,0,0,0,"X",null,null,null,null,0,0,0,0]
[null,40,null,null,null,null,null,null,null,null,null,null,null,"",null,"",null,null,null,"","",null,null,0,"","",0,null,0,0,0,0,0,0,0,"X",null,null,null,null,0,0,0,0]
[null,41,null,null,null,null,null,null,null,null,null,null,null,"",null,"",null,null,null,"","",null,null,0,"","",0,null,0,0,0,0,0,0,0,"X",null,null,null,null,0,0,0,0]
[null,42,null,null,null,null,null,null,null,null,null,null,null,"",null,"",null,null,null,"","",null,null,0,"","",0,null,0,0,0,0,0,0,0,"X",null,null,null,null,0,0,0,0]
[null,43,null,null,null,null,null,null,null,null,null,null,null,"",null,"",null,null,null,"","",null,null,0,"","",0,null,0,0,0,0,0,0,0,"X",null,null,null,null,0,0,0,0]
[null,44,null,null,null,null,null,null,null,null,null,null,null,"",null,"",null,null,null,"","",null,null,0,"","",0,null,0,0,0,0,0,0,0,"X",null,null,null,null,0,0,0,0]
[null,45,null,null,null,null,null,null,null,null,null,null,null,"",null,"",null,null,null,"","",null,null,0,"","",0,null,0,0,0,0,0,0,0,"X",null,null,null,null,0,0,0,0]
[null,46,null,null,null,null,null,null,null,null,null,null,null,"",null,"",null,null,null,"","",null,null,0,"","",0,null,0,0,0,0,0,0,0,"X",null,null,null,null,0,0,0,0]
[null,47,null,null,null,null,null,null,null,null,null,null,null,"",null,"",null,null,null,"","",null,null,0,"","",0,null,0,0,0,0,0,0,0,"X",null,null,null,null,0,0,0,0]
[null,48,null,null,null,null,null,null,null,null,null,null,null,"",null,"",null,null,null,"","",null,null,0,"","",0,null,0,{"$f":"IF(AND(AC79=1,(IF(N79=\"\",0,N79)*24>0)),1,0)","v":0},{"$f":"IF(AND(AC79=1,(IF(N79=\"\",0,N79)*24>=5)),1,0)","v":0},{"$f":"IF(AND(AC79=1,(IF(N79=\"\",0,N79)*24>=8)),1,0)","v":0},{"$f":"IF(AND(AC79=1,(IF(N79=\"\",0,N79)*24>=24)),1,0)","v":0},{"$f":"IF(AND(AC79=1,NOT(N79=\"\"),X79>1),4,0)","v":0},0,"X",null,null,null,null,0,0,{"$f":"IF(OR(AND(AO79=0,AP79=0),(AND(NOT(AO79=0),AP79=1))),0,1)","v":0},0]
[null,49,null,null,null,null,null,null,null,null,null,null,null,"",null,"",null,null,null,"","",null,null,0,"","",0,null,0,0,0,0,0,0,0,"X",null,null,null,null,0,{"$f":"COUNTIF(F80:H80,\"x\")","v":0},0,0]
[null,50,null,null,null,null,null,null,null,null,null,null,null,{"$f":"IF(AND(Y81=\"\",Z81=\"\",NOT(C81=\"\")),IF(M81=\"\",\"24:00\"-L81,M81-L81),\"\")","v":""},null,{"$f":"IF(AR81=0,\"\",IF(I81=\"x\",O81*$Z$10,0))","v":""},null,null,null,{"$f":"IF(OR(AJ81=\"X\",AR81=0),\"\",AJ81)","v":""},"",null,null,{"$f":"COUNT(N81)","v":0},{"$f":"IF(OR(C81=\"\",NOT(L81=\"\")),\"\",\"Zeiten ?\")","v":""},"",{"$f":"IF(AND(Y81=\"\",Z81=\"\"),0,IF(AND(NOT(Y81=\"\"),NOT(Z81=\"\")),2,1))","v":0},null,{"$f":"IF(J81=\"x\",1,0)","v":0},0,0,0,0,0,{"$f":"SUM(AD81:AH81)","v":0},{"$f":"VLOOKUP(AI81,$AL$14:$AM$22,2)","v":"X"},null,null,null,null,{"$f":"IF(C81=\"\",0,IF(OR(F81=\"x\",G81=\"x\"),3,IF(H81=\"x\",2,1)))","v":0},0,0,{"$f":"IF(AND(AQ81=0,AO81>1),1,0)","v":0}]
[null,51,null,null,null,null,null,null,null,null,null,null,null,{"$f":"IF(AND(Y82=\"\",Z82=\"\",NOT(C82=\"\")),IF(M82=\"\",\"24:00\"-L82,M82-L82),\"\")","v":""},null,"",null,null,null,"","",null,null,0,"","",0,null,0,0,0,0,0,0,0,"X",null,null,null,null,0,0,0,0]
[null,52,null,null,null,null,null,null,null,null,null,null,null,"",null,"",null,null,null,"","",null,null,0,"","",0,null,0,0,0,0,0,0,0,"X",null,null,null,null,0,0,0,0]
[null,53,null,null,null,null,null,null,null,null,null,null,null,"",null,"",null,null,null,"","",null,null,0,"","",0,null,0,0,0,0,0,0,0,"X",null,null,null,null,0,0,0,0]
[null,54,null,null,null,null,null,null,null,null,null,null,null,"",null,"",null,null,null,"","",null,null,0,"","",0,null,0,0,0,0,0,0,0,{"$f":"VLOOKUP(AI85,$AL$14:$AM$22,2)","v":"X"},null,null,null,null,{"$f":"IF(C85=\"\",0,IF(OR(F85=\"x\",G85=\"x\"),3,IF(H85=\"x\",2,1)))","v":0},0,0,0]
[null,"Summen:",null,null,null,null,null,null,null,null,null,null,null,null,null,{"$f":"SUM(P14:P85)","v":0},{"$f":"SUM(Q14:Q85)","v":0},{"$f":"SUM(R14:R85)","v":0},null,{"$f":"SUM(T14:T85)","v":0},{"$f":"SUM(U14:U85)","v":0}]
[null,"Tagegeld: Turnierleitung",null,{"$f":"SUMIF(AO14:AO85,\"2\",T14:T85)","v":0},"FK km-Geld: Turnierleitung",null,null,null,{"$f":"SUMIF(AO14:AO85,\"2\",P14:P85)","v":0},null,"FK öffentl VkM: Turnierleitung",null,null,null,null,{"$f":"SUMIF(AO14:AO85,\"2\",Q14:Q85)","v":0},"Hotel: Turnierleitung",null,null,null,{"$f":"SUMIF(AO14:AO85,\"2\",R14:R85)","v":0}]
[null,"Tagegeld: Schiedsrichter",null,{"$f":"SUMIF(AO14:AO85,\"3\",T14:T85)","v":0},"FK km-Geld: Schiedsrichter",null,null,null,{"$f":"SUMIF(AO14:AO85,\"3\",P14:P85)","v":0},null,"FK öffentl VkM: Schiedsrichter",null,null,null,null,{"$f":"SUMIF(AO14:AO85,\"3\",Q14:Q85)","v":0},"Hotel: Schiedsrichter",null,null,null,{"$f":"SUMIF(AO14:AO85,\"3\",R14:R85)","v":0}]
[]
[]
[]
[]
[]
[]
[]
[]
[]
[null,null,null,null,null,null,null,null,null,null,null,null,null,null,null,null,null,null,null,null,null,null,null,null,null,null,22]

{"sheet":"8 Empfangsblatt Team","index":7,"n_rows":64,"n_cols":20,"rows_kept":64,"cut":false,"hidden":false,"merged":[[64,1,64,20],[48,18,48,20],[49,18,49,20],[50,18,50,20],[51,18,51,20],[52,18,52,20],[58,18,58,20],[59,18,59,20],[63,1,63,6],[57,18,57,20],[56,18,56,20],[63,17,63,20],[53,18,53,20],[54,18,54,20],[62,18,62,20],[60,18,60,20],[34,18,36,20],[37,18,37,20],[38,18,38,20],[42,18,42,20],[46,18,46,20],[39,18,39,20],[40,18,40,20],[41,18,41,20],[55,18,55,20],[43,18,43,20],[44,18,44,20],[45,18,45,20],[20,18,20,20],[47,18,47,20],[21,18,21,20],[22,18,22,20],[29,18,29,20],[30,18,30,20],[23,18,23,20],[24,18,24,20],[25,18,25,20],[26,18,26,20],[27,18,27,20],[28,18,28,20],[33,2,33,7],[33,8,33,11],[33,12,33,17],[34,11,34,14],[34,15,34,16],[34,17,36,17],[35,11,35,12],[34,9,34,10],[34,1,36,1],[34,2,36,2],[34,3,36,3],[34,4,34,6],[34,7,34,8],[35,4,36,4],[35,5,36,5],[35,6,36,6],[7,18,9,20],[10,18,10,20],[11,18,11,20],[12,18,12,20],[14,18,14,20],[16,18,16,20],[17,18,17,20],[18,18,18,20],[13,18,13,20],[19,18,19,20],[1,18,1,20],[61,18,61,20],[33,19,33,20],[1,1,1,17],[2,1,2,17],[3,6,3,17],[4,1,4,17],[31,18,31,20],[32,1,32,20],[5,1,5,17],[6,19,6,20],[7,2,9,2],[4,18,4,20],[3,18,3,19],[7,15,7,16],[7,17,9,17],[2,18,2,19],[15,18,15,20],[6,2,6,7],[7,1,9,1],[3,1,3,5],[5,18,5,20],[6,9,6,14],[7,3,9,3],[7,4,7,6],[7,7,7,8],[8,4,9,4],[8,5,9,5],[8,6,9,6],[8,11,8,12],[7,9,7,10],[7,11,7,14]]}
[]
[]
[null,"Tischtennis Baden-Württemberg e.V.",null,null,null,null,null,null,null,null,null,null,null,null,null,null,null,null,{"$f":"IF(Kostenstelle=\"\",\"\",Kostenstelle)","v":""}]
[null,"Veranstaltung:",null,null,null,null,{"$f":"IF(Veranstaltung=\"\",\"\",Veranstaltung)","v":""},null,null,null,null,null,null,null,null,null,null,null,"Kostenstelle"]
[]
[]
[null,null,"Empfangsblatt: Spieler und Betreuer (Team)",null,null,null,null,null,"Ort:",{"$f":"IF(Ort=\"\",\"\",Ort)","v":""},null,null,null,null,null,null,"Datum: ",{"$f":"IF(Datum=\"\",\"\",Datum)","v":""},"Blatt:","1"]
[null,"Nr.","Name","Wohnort","----- Reisezeit -----",null,null,"Tagegeld",null,"Honorar",null,"Fahrgeld   (wenn Fahrer) + Öff.VkM",null,null,null,"Summe",null,"Anmerkung und\nSonstiges","Unterschrift"]
[null,null,null,null,"von","bis","Dauer","Kalk.","Ist","Kalk.","Ist","Strecke  [km]",null,"Kalk.","Ist","Kalk.","Ist"]
[null,null,null,null,null,null,null,"€","€","€","€","Kalk.","Ist","€","€","€","€"]
[null,"S1",{"$f":"IF('1 Deckblatt St.2024-04-09'!F24=\"\",\"\",CONCATENATE('1 Deckblatt St.2024-04-09'!F24,\", \",'1 Deckblatt St.2024-04-09'!G24))","v":""},{"$f":"IF('1 Deckblatt St.2024-04-09'!H24=\"\",\"\",'1 Deckblatt St.2024-04-09'!H24)","v":""},null,null,null,null,null,null,null,null,null,null,null,{"$f":"IF(C11=\"\",\"\",SUM(H11,J11,N11))","v":""}]
[null,"S2",{"$f":"IF('1 Deckblatt St.2024-04-09'!F25=\"\",\"\",CONCATENATE('1 Deckblatt St.2024-04-09'!F25,\", \",'1 Deckblatt St.2024-04-09'!G25))","v":""},{"$f":"IF('1 Deckblatt St.2024-04-09'!H25=\"\",\"\",'1 Deckblatt St.2024-04-09'!H25)","v":""},null,null,null,null,null,null,null,null,null,null,null,{"$f":"IF(C12=\"\",\"\",SUM(H12,J12,N12))","v":""}]
[null,"S3",{"$f":"IF('1 Deckblatt St.2024-04-09'!F26=\"\",\"\",CONCATENATE('1 Deckblatt St.2024-04-09'!F26,\", \",'1 Deckblatt St.2024-04-09'!G26))","v":""},{"$f":"IF('1 Deckblatt St.2024-04-09'!H26=\"\",\"\",'1 Deckblatt St.2024-04-09'!H26)","v":""},null,null,null,null,null,null,null,null,null,null,null,""]
[null,"S4",{"$f":"IF('1 Deckblatt St.2024-04-09'!F27=\"\",\"\",CONCATENATE('1 Deckblatt St.2024-04-09'!F27,\", \",'1 Deckblatt St.2024-04-09'!G27))","v":""},{"$f":"IF('1 Deckblatt St.2024-04-09'!H27=\"\",\"\",'1 Deckblatt St.2024-04-09'!H27)","v":""},null,null,null,null,null,null,null,null,null,null,null,""]
[null,"S5",{"$f":"IF('1 Deckblatt St.2024-04-09'!F28=\"\",\"\",CONCATENATE('1 Deckblatt St.2024-04-09'!F28,\", \",'1 Deckblatt St.2024-04-09'!G28))","v":""},{"$f":"IF('1 Deckblatt St.2024-04-09'!H28=\"\",\"\",'1 Deckblatt St.2024-04-09'!H28)","v":""},null,null,null,null,null,null,null,null,null,null,null,""]
[null,"S6",{"$f":"IF('1 Deckblatt St.2024-04-09'!F29=\"\",\"\",CONCATENATE('1 Deckblatt St.2024-04-09'!F29,\", \",'1 Deckblatt St.2024-04-09'!G29))","v":""},{"$f":"IF('1 Deckblatt St.2024-04-09'!H29=\"\",\"\",'1 Deckblatt St.2024-04-09'!H29)","v":""},null,null,null,null,null,null,null,null,null,null,null,""]
[null,"S7",{"$f":"IF('1 Deckblatt St.2024-04-09'!F30=\"\",\"\",CONCATENATE('1 Deckblatt St.2024-04-09'!F30,\", \",'1 Deckblatt St.2024-04-09'!G30))","v":""},{"$f":"IF('1 Deckblatt St.2024-04-09'!H30=\"\",\"\",'1 Deckblatt St.2024-04-09'!H30)","v":""},null,null,null,null,null,null,null,null,null,null,null,""]
[null,"S8",{"$f":"IF('1 Deckblatt St.2024-04-09'!F31=\"\",\"\",CONCATENATE('1 Deckblatt St.2024-04-09'!F31,\", \",'1 Deckblatt St.2024-04-09'!G31))","v":""},{"$f":"IF('1 Deckblatt St.2024-04-09'!H31=\"\",\"\",'1 Deckblatt St.2024-04-09'!H31)","v":""},null,null,null,null,null,null,null,null,null,null,null,""]
[null,"S9",{"$f":"IF('1 Deckblatt St.2024-04-09'!F32=\"\",\"\",CONCATENATE('1 Deckblatt St.2024-04-09'!F32,\", \",'1 Deckblatt St.2024-04-09'!G32))","v":""},{"$f":"IF('1 Deckblatt St.2024-04-09'!H32=\"\",\"\",'1 Deckblatt St.2024-04-09'!H32)","v":""},null,null,null,null,null,null,null,null,null,null,null,{"$f":"IF(C19=\"\",\"\",SUM(H19,J19,N19))","v":""}]
[null,"S10",{"$f":"IF('1 Deckblatt St.2024-04-09'!F33=\"\",\"\",CONCATENATE('1 Deckblatt St.2024-04-09'!F33,\", \",'1 Deckblatt St.2024-04-09'!G33))","v":""},{"$f":"IF('1 Deckblatt St.2024-04-09'!H33=\"\",\"\",'1 Deckblatt St.2024-04-09'!H33)","v":""},null,null,null,null,null,null,null,null,null,null,null,""]
[null,"S11",{"$f":"IF('1 Deckblatt St.2024-04-09'!F34=\"\",\"\",CONCATENATE('1 Deckblatt St.2024-04-09'!F34,\", \",'1 Deckblatt St.2024-04-09'!G34))","v":""},{"$f":"IF('1 Deckblatt St.2024-04-09'!H34=\"\",\"\",'1 Deckblatt St.2024-04-09'!H34)","v":""},null,null,null,null,null,null,null,null,null,null,null,""]
[null,"S12",{"$f":"IF('1 Deckblatt St.2024-04-09'!F35=\"\",\"\",CONCATENATE('1 Deckblatt St.2024-04-09'!F35,\", \",'1 Deckblatt St.2024-04-09'!G35))","v":""},{"$f":"IF('1 Deckblatt St.2024-04-09'!H35=\"\",\"\",'1 Deckblatt St.2024-04-09'!H35)","v":""},null,null,null,null,null,null,null,null,null,null,null,""]
[null,"S13",{"$f":"IF('1 Deckblatt St.2024-04-09'!F36=\"\",\"\",CONCATENATE('1 Deckblatt St.2024-04-09'!F36,\", \",'1 Deckblatt St.2024-04-09'!G36))","v":""},{"$f":"IF('1 Deckblatt St.2024-04-09'!H36=\"\",\"\",'1 Deckblatt St.2024-04-09'!H36)","v":""},null,null,null,null,null,null,null,null,null,null,null,""]
[null,"S14",{"$f":"IF('1 Deckblatt St.2024-04-09'!F37=\"\",\"\",CONCATENATE('1 Deckblatt St.2024-04-09'!F37,\", \",'1 Deckblatt St.2024-04-09'!G37))","v":""},{"$f":"IF('1 Deckblatt St.2024-04-09'!H37=\"\",\"\",'1 Deckblatt St.2024-04-09'!H37)","v":""},null,null,null,null,null,null,null,null,null,null,null,""]
[null,"S15",{"$f":"IF('1 Deckblatt St.2024-04-09'!F38=\"\",\"\",CONCATENATE('1 Deckblatt St.2024-04-09'!F38,\", \",'1 Deckblatt St.2024-04-09'!G38))","v":""},{"$f":"IF('1 Deckblatt St.2024-04-09'!H38=\"\",\"\",'1 Deckblatt St.2024-04-09'!H38)","v":""},null,null,null,null,null,null,null,null,null,null,null,""]
[null,"S16",{"$f":"IF('1 Deckblatt St.2024-04-09'!F39=\"\",\"\",CONCATENATE('1 Deckblatt St.2024-04-09'!F39,\", \",'1 Deckblatt St.2024-04-09'!G39))","v":""},{"$f":"IF('1 Deckblatt St.2024-04-09'!H39=\"\",\"\",'1 Deckblatt St.2024-04-09'!H39)","v":""},null,null,null,null,null,null,null,null,null,null,null,""]
[null,"S17",{"$f":"IF('1 Deckblatt St.2024-04-09'!K24=\"\",\"\",CONCATENATE('1 Deckblatt St.2024-04-09'!K24,\", \",'1 Deckblatt St.2024-04-09'!L24))","v":""},{"$f":"IF('1 Deckblatt St.2024-04-09'!M24=\"\",\"\",'1 Deckblatt St.2024-04-09'!M24)","v":""},null,null,null,null,null,null,null,null,null,null,null,{"$f":"IF(C27=\"\",\"\",SUM(H27,J27,N27))","v":""}]
[null,"S18",{"$f":"IF('1 Deckblatt St.2024-04-09'!K25=\"\",\"\",CONCATENATE('1 Deckblatt St.2024-04-09'!K25,\", \",'1 Deckblatt St.2024-04-09'!L25))","v":""},{"$f":"IF('1 Deckblatt St.2024-04-09'!M25=\"\",\"\",'1 Deckblatt St.2024-04-09'!M25)","v":""},null,null,null,null,null,null,null,null,null,null,null,""]
[null,"S19",{"$f":"IF('1 Deckblatt St.2024-04-09'!K26=\"\",\"\",CONCATENATE('1 Deckblatt St.2024-04-09'!K26,\", \",'1 Deckblatt St.2024-04-09'!L26))","v":""},{"$f":"IF('1 Deckblatt St.2024-04-09'!M26=\"\",\"\",'1 Deckblatt St.2024-04-09'!M26)","v":""},null,null,null,null,null,null,null,null,null,null,null,""]
[null,"S20",{"$f":"IF('1 Deckblatt St.2024-04-09'!K27=\"\",\"\",CONCATENATE('1 Deckblatt St.2024-04-09'!K27,\", \",'1 Deckblatt St.2024-04-09'!L27))","v":""},{"$f":"IF('1 Deckblatt St.2024-04-09'!M27=\"\",\"\",'1 Deckblatt St.2024-04-09'!M27)","v":""},null,null,null,null,null,null,null,null,null,null,null,""]
[null,"S21",{"$f":"IF('1 Deckblatt St.2024-04-09'!K28=\"\",\"\",CONCATENATE('1 Deckblatt St.2024-04-09'!K28,\", \",'1 Deckblatt St.2024-04-09'!L28))","v":""},{"$f":"IF('1 Deckblatt St.2024-04-09'!M28=\"\",\"\",'1 Deckblatt St.2024-04-09'!M28)","v":""},null,null,null,null,null,null,null,null,null,null,null,{"$f":"IF(C31=\"\",\"\",SUM(H31,J31,N31))","v":""}]
[null,"S22",{"$f":"C38","v":""},{"$f":"IF('1 Deckblatt St.2024-04-09'!M29=\"\",\"\",'1 Deckblatt St.2024-04-09'!M29)","v":""},null,null,null,null,null,null,null,null,null,null,null,""]
[]
[null,null,"Empfangsblatt: Spieler und Betreuer (Team)",null,null,null,null,null,"Veranstaltung:",null,null,null,{"$f":"IF(Veranstaltung=\"\",\"\",Veranstaltung)","v":""},null,null,null,null,null,"Blatt:","2"]
[null,"Nr.","Name","Wohnort","----- Reisezeit -----",null,null,"Tagegeld",null,"Honorar",null,"Fahrgeld   (wenn Fahrer) + Öff.VkM",null,null,null,"Summe",null,"Anmerkung und\nSonstiges","Unterschrift"]
[null,null,null,null,"von","bis","Dauer","Kalk.","Ist","Kalk.","Ist","Strecke  [km]",null,"Kalk.","Ist","Kalk.","Ist"]
[null,null,null,null,null,null,null,"€","€","€","€","Kalk.","Ist","€","€","€","€"]
[null,"S23",{"$f":"IF('1 Deckblatt St.2024-04-09'!K30=\"\",\"\",CONCATENATE('1 Deckblatt St.2024-04-09'!K30,\", \",'1 Deckblatt St.2024-04-09'!L30))","v":""},{"$f":"IF('1 Deckblatt St.2024-04-09'!M30=\"\",\"\",'1 Deckblatt St.2024-04-09'!M30)","v":""},null,null,null,null,null,null,null,null,null,null,null,{"$f":"IF(C38=\"\",\"\",SUM(H38,J38,N38))","v":""}]
[null,"S24",{"$f":"IF('1 Deckblatt St.2024-04-09'!K31=\"\",\"\",CONCATENATE('1 Deckblatt St.2024-04-09'!K31,\", \",'1 Deckblatt St.2024-04-09'!L31))","v":""},{"$f":"IF('1 Deckblatt St.2024-04-09'!M31=\"\",\"\",'1 Deckblatt St.2024-04-09'!M31)","v":""},null,null,null,null,null,null,null,null,null,null,null,{"$f":"IF(C39=\"\",\"\",SUM(H39,J39,N39))","v":""}]
[null,"S25",{"$f":"IF('1 Deckblatt St.2024-04-09'!K32=\"\",\"\",CONCATENATE('1 Deckblatt St.2024-04-09'!K32,\", \",'1 Deckblatt St.2024-04-09'!L32))","v":""},{"$f":"IF('1 Deckblatt St.2024-04-09'!M32=\"\",\"\",'1 Deckblatt St.2024-04-09'!M32)","v":""},null,null,null,null,null,null,null,null,null,null,null,""]
[null,"S26",{"$f":"IF('1 Deckblatt St.2024-04-09'!K33=\"\",\"\",CONCATENATE('1 Deckblatt St.2024-04-09'!K33,\", \",'1 Deckblatt St.2024-04-09'!L33))","v":""},{"$f":"IF('1 Deckblatt St.2024-04-09'!M33=\"\",\"\",'1 Deckblatt St.2024-04-09'!M33)","v":""},null,null,null,null,null,null,null,null,null,null,null,""]
[null,"S27",{"$f":"IF('1 Deckblatt St.2024-04-09'!K34=\"\",\"\",CONCATENATE('1 Deckblatt St.2024-04-09'!K34,\", \",'1 Deckblatt St.2024-04-09'!L34))","v":""},{"$f":"IF('1 Deckblatt St.2024-04-09'!M34=\"\",\"\",'1 Deckblatt St.2024-04-09'!M34)","v":""},null,null,null,null,null,null,null,null,null,null,null,""]
[null,"S28",{"$f":"IF('1 Deckblatt St.2024-04-09'!K35=\"\",\"\",CONCATENATE('1 Deckblatt St.2024-04-09'!K35,\", \",'1 Deckblatt St.2024-04-09'!L35))","v":""},{"$f":"IF('1 Deckblatt St.2024-04-09'!M35=\"\",\"\",'1 Deckblatt St.2024-04-09'!M35)","v":""},null,null,null,null,null,null,null,null,null,null,null,""]
[null,"S29",{"$f":"IF('1 Deckblatt St.2024-04-09'!K36=\"\",\"\",CONCATENATE('1 Deckblatt St.2024-04-09'!K36,\", \",'1 Deckblatt St.2024-04-09'!L36))","v":""},{"$f":"IF('1 Deckblatt St.2024-04-09'!M36=\"\",\"\",'1 Deckblatt St.2024-04-09'!M36)","v":""},null,null,null,null,null,null,null,null,null,null,null,""]
[null,"S30",{"$f":"IF('1 Deckblatt St.2024-04-09'!K37=\"\",\"\",CONCATENATE('1 Deckblatt St.2024-04-09'!K37,\", \",'1 Deckblatt St.2024-04-09'!L37))","v":""},{"$f":"IF('1 Deckblatt St.2024-04-09'!M37=\"\",\"\",'1 Deckblatt St.2024-04-09'!M37)","v":""},null,null,null,null,null,null,null,null,null,null,null,""]
[null,"S31",{"$f":"IF('1 Deckblatt St.2024-04-09'!K38=\"\",\"\",CONCATENATE('1 Deckblatt St.2024-04-09'!K38,\", \",'1 Deckblatt St.2024-04-09'!L38))","v":""},{"$f":"IF('1 Deckblatt St.2024-04-09'!M38=\"\",\"\",'1 Deckblatt St.2024-04-09'!M38)","v":""},null,null,null,null,null,null,null,null,null,null,null,""]
[null,"S32",{"$f":"IF('1 Deckblatt St.2024-04-09'!K39=\"\",\"\",CONCATENATE('1 Deckblatt St.2024-04-09'!K39,\", \",'1 Deckblatt St.2024-04-09'!L39))","v":""},{"$f":"IF('1 Deckblatt St.2024-04-09'!M39=\"\",\"\",'1 Deckblatt St.2024-04-09'!M39)","v":""},null,null,null,null,null,null,null,null,null,null,null,""]
[null,"B1",{"$f":"IF('1 Deckblatt St.2024-04-09'!F42=\"\",\"\",CONCATENATE('1 Deckblatt St.2024-04-09'!F42,\", \",'1 Deckblatt St.2024-04-09'!G42))","v":""},{"$f":"IF('1 Deckblatt St.2024-04-09'!H42=\"\",\"\",'1 Deckblatt St.2024-04-09'!H42)","v":""},null,null,null,{"$f":"IF(C48=\"\",\"\",'4 Honorar+TG, Betreuer'!R15)","v":""},null,{"$f":"IF(C48=\"\",\"\",'4 Honorar+TG, Betreuer'!S15)","v":""},null,{"$f":"IF(C48=\"\",\"\", '5 Fahrgeld + s.A.'!H14)","v":""},null,{"$f":"IF(C48=\"\",\"\",SUM('5 Fahrgeld + s.A.'!I14:J14))","v":""},null,""]
[null,"B2",{"$f":"IF('1 Deckblatt St.2024-04-09'!F43=\"\",\"\",CONCATENATE('1 Deckblatt St.2024-04-09'!F43,\", \",'1 Deckblatt St.2024-04-09'!G43))","v":""},{"$f":"IF('1 Deckblatt St.2024-04-09'!H43=\"\",\"\",'1 Deckblatt St.2024-04-09'!H43)","v":""},null,null,null,{"$f":"IF(C49=\"\",\"\",'4 Honorar+TG, Betreuer'!R20)","v":""},null,{"$f":"IF(C49=\"\",\"\",'4 Honorar+TG, Betreuer'!S20)","v":""},null,{"$f":"IF(C49=\"\",\"\", '5 Fahrgeld + s.A.'!H15)","v":""},null,{"$f":"IF(C49=\"\",\"\",SUM('5 Fahrgeld + s.A.'!I15:J15))","v":""},null,""]
[null,"B3",{"$f":"IF('1 Deckblatt St.2024-04-09'!F44=\"\",\"\",CONCATENATE('1 Deckblatt St.2024-04-09'!F44,\", \",'1 Deckblatt St.2024-04-09'!G44))","v":""},{"$f":"IF('1 Deckblatt St.2024-04-09'!H44=\"\",\"\",'1 Deckblatt St.2024-04-09'!H44)","v":""},null,null,null,{"$f":"IF(C50=\"\",\"\",'4 Honorar+TG, Betreuer'!R25)","v":""},null,{"$f":"IF(C50=\"\",\"\",'4 Honorar+TG, Betreuer'!S25)","v":""},null,{"$f":"IF(C50=\"\",\"\", '5 Fahrgeld + s.A.'!H16)","v":""},null,{"$f":"IF(C50=\"\",\"\",SUM('5 Fahrgeld + s.A.'!I16:J16))","v":""},null,""]
[null,"B4",{"$f":"IF('1 Deckblatt St.2024-04-09'!F45=\"\",\"\",CONCATENATE('1 Deckblatt St.2024-04-09'!F45,\", \",'1 Deckblatt St.2024-04-09'!G45))","v":""},{"$f":"IF('1 Deckblatt St.2024-04-09'!H45=\"\",\"\",'1 Deckblatt St.2024-04-09'!H45)","v":""},null,null,null,{"$f":"IF(C51=\"\",\"\",'4 Honorar+TG, Betreuer'!R30)","v":""},null,{"$f":"IF(C51=\"\",\"\",'4 Honorar+TG, Betreuer'!S30)","v":""},null,{"$f":"IF(C51=\"\",\"\", '5 Fahrgeld + s.A.'!H17)","v":""},null,{"$f":"IF(C51=\"\",\"\",SUM('5 Fahrgeld + s.A.'!I17:J17))","v":""},null,""]
[null,"B5",{"$f":"IF('1 Deckblatt St.2024-04-09'!F46=\"\",\"\",CONCATENATE('1 Deckblatt St.2024-04-09'!F46,\", \",'1 Deckblatt St.2024-04-09'!G46))","v":""},{"$f":"IF('1 Deckblatt St.2024-04-09'!H46=\"\",\"\",'1 Deckblatt St.2024-04-09'!H46)","v":""},null,null,null,{"$f":"IF(C52=\"\",\"\",'4 Honorar+TG, Betreuer'!R35)","v":""},null,{"$f":"IF(C52=\"\",\"\",'4 Honorar+TG, Betreuer'!S35)","v":""},null,{"$f":"IF(C52=\"\",\"\", '5 Fahrgeld + s.A.'!H18)","v":""},null,{"$f":"IF(C52=\"\",\"\",SUM('5 Fahrgeld + s.A.'!I18:J18))","v":""},null,""]
[null,"B6",{"$f":"IF('1 Deckblatt St.2024-04-09'!F47=\"\",\"\",CONCATENATE('1 Deckblatt St.2024-04-09'!F47,\", \",'1 Deckblatt St.2024-04-09'!G47))","v":""},{"$f":"IF('1 Deckblatt St.2024-04-09'!H47=\"\",\"\",'1 Deckblatt St.2024-04-09'!H47)","v":""},null,null,null,{"$f":"IF(C53=\"\",\"\",'4 Honorar+TG, Betreuer'!R39)","v":""},null,{"$f":"IF(C53=\"\",\"\",'4 Honorar+TG, Betreuer'!S39)","v":""},null,{"$f":"IF(C53=\"\",\"\", '5 Fahrgeld + s.A.'!H19)","v":""},null,{"$f":"IF(C53=\"\",\"\",SUM('5 Fahrgeld + s.A.'!I19:J19))","v":""},null,""]
[null,"B7",{"$f":"IF('1 Deckblatt St.2024-04-09'!K42=\"\",\"\",CONCATENATE('1 Deckblatt St.2024-04-09'!K42,\", \",'1 Deckblatt St.2024-04-09'!L42))","v":""},{"$f":"IF('1 Deckblatt St.2024-04-09'!M42=\"\",\"\",'1 Deckblatt St.2024-04-09'!M42)","v":""},null,null,null,{"$f":"IF(C54=\"\",\"\",'4 Honorar+TG, Betreuer'!R43)","v":""},null,{"$f":"IF(C54=\"\",\"\",'4 Honorar+TG, Betreuer'!S43)","v":""},null,{"$f":"IF(C54=\"\",\"\", '5 Fahrgeld + s.A.'!H20)","v":""},null,{"$f":"IF(C54=\"\",\"\",SUM('5 Fahrgeld + s.A.'!I20:J20))","v":""},null,""]
[null,"B8",{"$f":"IF('1 Deckblatt St.2024-04-09'!K43=\"\",\"\",CONCATENATE('1 Deckblatt St.2024-04-09'!K43,\", \",'1 Deckblatt St.2024-04-09'!L43))","v":""},{"$f":"IF('1 Deckblatt St.2024-04-09'!M43=\"\",\"\",'1 Deckblatt St.2024-04-09'!M43)","v":""},null,null,null,{"$f":"IF(C55=\"\",\"\",'4 Honorar+TG, Betreuer'!R47)","v":""},null,{"$f":"IF(C55=\"\",\"\",'4 Honorar+TG, Betreuer'!S47)","v":""},null,{"$f":"IF(C55=\"\",\"\", '5 Fahrgeld + s.A.'!H21)","v":""},null,{"$f":"IF(C55=\"\",\"\",SUM('5 Fahrgeld + s.A.'!I21:J21))","v":""},null,""]
[null,"B9",{"$f":"IF('1 Deckblatt St.2024-04-09'!K44=\"\",\"\",CONCATENATE('1 Deckblatt St.2024-04-09'!K44,\", \",'1 Deckblatt St.2024-04-09'!L44))","v":""},{"$f":"IF('1 Deckblatt St.2024-04-09'!M44=\"\",\"\",'1 Deckblatt St.2024-04-09'!M44)","v":""},null,null,null,{"$f":"IF(C56=\"\",\"\",'4 Honorar+TG, Betreuer'!R51)","v":""},null,{"$f":"IF(C56=\"\",\"\",'4 Honorar+TG, Betreuer'!S51)","v":""},null,{"$f":"IF(C56=\"\",\"\", '5 Fahrgeld + s.A.'!H22)","v":""},null,{"$f":"IF(C56=\"\",\"\",SUM('5 Fahrgeld + s.A.'!I22:J22))","v":""},null,""]
[null,"B10",{"$f":"IF('1 Deckblatt St.2024-04-09'!K45=\"\",\"\",CONCATENATE('1 Deckblatt St.2024-04-09'!K45,\", \",'1 Deckblatt St.2024-04-09'!L45))","v":""},{"$f":"IF('1 Deckblatt St.2024-04-09'!M45=\"\",\"\",'1 Deckblatt St.2024-04-09'!M45)","v":""},null,null,null,{"$f":"IF(C57=\"\",\"\",'4 Honorar+TG, Betreuer'!R55)","v":""},null,{"$f":"IF(C57=\"\",\"\",'4 Honorar+TG, Betreuer'!S55)","v":""},null,{"$f":"IF(C57=\"\",\"\", '5 Fahrgeld + s.A.'!H23)","v":""},null,{"$f":"IF(C57=\"\",\"\",SUM('5 Fahrgeld + s.A.'!I23:J23))","v":""},null,""]
[null,"B11",{"$f":"IF('1 Deckblatt St.2024-04-09'!K46=\"\",\"\",CONCATENATE('1 Deckblatt St.2024-04-09'!K46,\", \",'1 Deckblatt St.2024-04-09'!L46))","v":""},{"$f":"IF('1 Deckblatt St.2024-04-09'!M46=\"\",\"\",'1 Deckblatt St.2024-04-09'!M46)","v":""},null,null,null,{"$f":"IF(C58=\"\",\"\",'4 Honorar+TG, Betreuer'!R59)","v":""},null,{"$f":"IF(C58=\"\",\"\",'4 Honorar+TG, Betreuer'!S59)","v":""},null,{"$f":"IF(C58=\"\",\"\", '5 Fahrgeld + s.A.'!H24)","v":""},null,{"$f":"IF(C58=\"\",\"\",SUM('5 Fahrgeld + s.A.'!I24:J24))","v":""},null,""]
[null,"B12",{"$f":"IF('1 Deckblatt St.2024-04-09'!K47=\"\",\"\",CONCATENATE('1 Deckblatt St.2024-04-09'!K47,\", \",'1 Deckblatt St.2024-04-09'!L47))","v":""},{"$f":"IF('1 Deckblatt St.2024-04-09'!M47=\"\",\"\",'1 Deckblatt St.2024-04-09'!M47)","v":""},null,null,null,{"$f":"IF(C59=\"\",\"\",'4 Honorar+TG, Betreuer'!R63)","v":""},null,{"$f":"IF(C59=\"\",\"\",'4 Honorar+TG, Betreuer'!S63)","v":""},null,{"$f":"IF(C59=\"\",\"\", '5 Fahrgeld + s.A.'!H25)","v":""},null,{"$f":"IF(C59=\"\",\"\",SUM('5 Fahrgeld + s.A.'!I25:J25))","v":""},null,""]
[null,"B13",{"$f":"IF('1 Deckblatt St.2024-04-09'!F50=\"\",\"\",CONCATENATE('1 Deckblatt St.2024-04-09'!F50,\", \",'1 Deckblatt St.2024-04-09'!G50))","v":""},{"$f":"IF('1 Deckblatt St.2024-04-09'!H50=\"\",\"\",'1 Deckblatt St.2024-04-09'!H50)","v":""},null,null,null,{"$f":"IF(C60=\"\",\"\",'4 Honorar+TG, Betreuer'!R68)","v":""},null,{"$f":"IF(C60=\"\",\"\",'4 Honorar+TG, Betreuer'!S68)","v":""},null,{"$f":"IF(C60=\"\",\"\", '5 Fahrgeld + s.A.'!H26)","v":""},15,{"$f":"IF(C60=\"\",\"\",SUM('5 Fahrgeld + s.A.'!I26:J26))","v":""},4.5,""]
[null,"B14",{"$f":"IF('1 Deckblatt St.2024-04-09'!F51=\"\",\"\",CONCATENATE('1 Deckblatt St.2024-04-09'!F51,\", \",'1 Deckblatt St.2024-04-09'!G51))","v":""},{"$f":"IF('1 Deckblatt St.2024-04-09'!H51=\"\",\"\",'1 Deckblatt St.2024-04-09'!H51)","v":""},null,null,null,{"$f":"IF(C61=\"\",\"\",'4 Honorar+TG, Betreuer'!R73)","v":""},null,{"$f":"IF(C61=\"\",\"\",'4 Honorar+TG, Betreuer'!S73)","v":""},null,{"$f":"IF(C61=\"\",\"\", '5 Fahrgeld + s.A.'!H27)","v":""},null,{"$f":"IF(C61=\"\",\"\",SUM('5 Fahrgeld + s.A.'!I27:J27))","v":""},null,""]
[null,"B15",{"$f":"IF('1 Deckblatt St.2024-04-09'!F52=\"\",\"\",CONCATENATE('1 Deckblatt St.2024-04-09'!F52,\", \",'1 Deckblatt St.2024-04-09'!G52))","v":""},{"$f":"IF('1 Deckblatt St.2024-04-09'!H52=\"\",\"\",'1 Deckblatt St.2024-04-09'!H52)","v":""},null,null,null,{"$f":"IF(C62=\"\",\"\",'4 Honorar+TG, Betreuer'!R78)","v":""},null,{"$f":"IF(C62=\"\",\"\",'4 Honorar+TG, Betreuer'!S78)","v":""},null,{"$f":"IF(C62=\"\",\"\", '5 Fahrgeld + s.A.'!H28)","v":""},null,{"$f":"IF(C62=\"\",\"\",SUM('5 Fahrgeld + s.A.'!I28:J28))","v":""},null,""]
[null,"B16",{"$f":"IF('1 Deckblatt St.2024-04-09'!F53=\"\",\"\",CONCATENATE('1 Deckblatt St.2024-04-09'!F53,\", \",'1 Deckblatt St.2024-04-09'!G53))","v":""},{"$f":"IF('1 Deckblatt St.2024-04-09'!H53=\"\",\"\",'1 Deckblatt St.2024-04-09'!H53)","v":""},null,null,null,{"$f":"IF(C63=\"\",\"\",'4 Honorar+TG, Betreuer'!R83)","v":""},null,{"$f":"IF(C63=\"\",\"\",'4 Honorar+TG, Betreuer'!S83)","v":""},null,{"$f":"IF(C63=\"\",\"\", '5 Fahrgeld + s.A.'!H29)","v":""},null,{"$f":"IF(C63=\"\",\"\",SUM('5 Fahrgeld + s.A.'!I29:J29))","v":""},null,{"$f":"IF(C63=\"\",\"\",SUM(H63,J63,N63))","v":""}]
[null,"Summe",null,null,null,null,null,{"$f":"SUM(H11:H32,H38:H63)","v":0},null,{"$f":"SUM(J11:J32,J38:J63)","v":0},null,null,null,{"$f":"SUM(N11:N32,N38:N63)","v":0},null,{"$f":"SUM(P11:P32,P38:P63)","v":0}]

{"sheet":"9 Empfangsblatt TL+Schiri","index":8,"n_rows":70,"n_cols":19,"rows_kept":70,"cut":false,"hidden":false,"merged":[[49,15,49,16],[50,15,50,16],[51,15,51,16],[46,15,46,16],[47,15,47,16],[1,1,1,16],[2,1,2,16],[3,6,3,16],[4,1,4,16],[37,1,39,1],[37,2,39,2],[37,3,39,3],[37,4,37,6],[37,7,37,8],[38,6,39,6],[38,5,39,5],[3,1,3,5],[6,9,6,13],[6,2,6,7],[7,1,9,1],[7,3,9,3],[7,9,7,12],[7,4,7,6],[8,5,9,5],[1,17,1,19],[4,17,4,19],[2,17,2,18],[3,17,3,18],[10,17,10,19],[21,17,21,19],[11,15,11,16],[12,17,12,19],[13,17,13,19],[10,15,10,16],[12,15,12,16],[13,15,13,16],[14,15,14,16],[15,15,15,16],[16,15,16,16],[17,15,17,16],[14,17,14,19],[15,17,15,19],[16,17,16,19],[17,17,17,19],[11,17,11,19],[5,1,5,16],[5,17,5,19],[6,15,6,16],[48,15,48,16],[8,6,9,6],[8,9,8,10],[7,15,9,16],[7,13,7,14],[7,2,9,2],[7,7,7,8],[8,4,9,4],[6,18,6,19],[7,17,9,19],[40,15,40,16],[36,10,36,16],[32,15,32,16],[28,15,28,16],[29,15,29,16],[30,15,30,16],[37,15,39,16],[31,15,31,16],[44,15,44,16],[42,15,42,16],[43,15,43,16],[24,17,24,19],[25,17,25,19],[32,17,32,19],[45,15,45,16],[20,15,20,16],[18,15,18,16],[19,15,19,16],[18,17,18,19],[19,17,19,19],[20,17,20,19],[23,17,23,19],[41,15,41,16],[44,17,44,19],[45,17,45,19],[40,17,40,19],[21,15,21,16],[22,15,22,16],[34,15,34,16],[26,15,26,16],[27,15,27,16],[24,15,24,16],[25,15,25,16],[37,9,37,12],[36,8,36,9],[38,4,39,4],[37,13,37,14],[23,15,23,16],[22,17,22,19],[33,17,33,19],[34,17,34,19],[28,17,28,19],[29,17,29,19],[30,17,30,19],[31,17,31,19],[26,17,26,19],[27,17,27,19],[35,1,35,19],[36,18,36,19],[37,17,39,19],[36,2,36,7],[38,9,38,10],[33,15,33,16],[55,17,55,19],[48,17,48,19],[49,17,49,19],[50,17,50,19],[51,17,51,19],[52,17,52,19],[53,17,53,19],[41,17,41,19],[42,17,42,19],[43,17,43,19],[54,17,54,19],[46,17,46,19],[47,17,47,19],[59,15,59,16],[60,17,60,19],[56,17,56,19],[57,17,57,19],[58,17,58,19],[59,17,59,19],[60,15,60,16],[63,15,63,16],[66,15,66,16],[54,15,54,16],[55,15,55,16],[52,15,52,16],[53,15,53,16],[70,1,70,19],[69,15,69,19],[61,17,61,19],[62,17,62,19],[63,17,63,19],[66,17,66,19],[67,17,67,19],[68,17,68,19],[68,15,68,16],[64,15,64,16],[64,17,64,19],[65,15,65,16],[65,17,65,19],[61,15,61,16],[69,1,69,6],[62,15,62,16],[67,15,67,16],[56,15,56,16],[57,15,57,16],[58,15,58,16]]}
[]
[]
[null,"Tischtennis Baden-Württemberg e.V.",null,null,null,null,null,null,null,null,null,null,null,null,null,null,null,{"$f":"IF(Kostenstelle=\"\",\"\",Kostenstelle)","v":""}]
[null,"Veranstaltung:",null,null,null,null,{"$f":"IF(Veranstaltung=\"\",\"\",Veranstaltung)","v":""},null,null,null,null,null,null,null,null,null,null,"Kostenstelle"]
[]
[]
[null,null,"Empfangsblatt: Turnierleitung und Schiedsrichter ",null,null,null,null,null,"Ort:",{"$f":"IF('1 Deckblatt St.2024-04-09'!G15=\"\",\"\",'1 Deckblatt St.2024-04-09'!G15)","v":""},null,null,null,null,"Datum: ",{"$f":"IF('1 Deckblatt St.2024-04-09'!G17=\"\",\"\",'1 Deckblatt St.2024-04-09'!G17)","v":""},null,"Blatt:","1"]
[null,"Nr.","Name","Wohnort","----- Reisezeit -----",null,null,"Tagegeld",null,"Fahrgeld   (wenn Fahrer) + Öff.VkM",null,null,null,"Summe",null,"Anmerkung und\nSonstiges",null,"Unterschrift"]
[null,null,null,null,"von","bis","Dauer","Kalk.","Ist","Strecke  [km]",null,"Kalk.","Ist","Kalk.","Ist"]
[null,null,null,null,null,null,null,"€","€","Kalk.","Ist","€","€","€","€"]
[null,1,{"$f":"IF('7 Turnierleitung+Schiri'!C14=\"\",\"\",'7 Turnierleitung+Schiri'!C14)","v":""},{"$f":"IF('7 Turnierleitung+Schiri'!D14=\"\",\"\",'7 Turnierleitung+Schiri'!D14)","v":""},null,null,null,{"$f":"IF(C11=\"\",\"\",SUM('7 Turnierleitung+Schiri'!T14:T16))","v":""},null,{"$f":"IF(C11=\"\",\"\",'7 Turnierleitung+Schiri'!O14)","v":""},null,{"$f":"IF(C11=\"\",\"\",SUM('7 Turnierleitung+Schiri'!P14:Q14))","v":""},null,{"$f":"IF(C11=\"\",\"\",SUM(H11,L11))","v":""}]
[null,2,{"$f":"IF('7 Turnierleitung+Schiri'!C17=\"\",\"\",'7 Turnierleitung+Schiri'!C17)","v":""},{"$f":"IF('7 Turnierleitung+Schiri'!D17=\"\",\"\",'7 Turnierleitung+Schiri'!D17)","v":""},null,null,null,{"$f":"IF(C12=\"\",\"\",SUM('7 Turnierleitung+Schiri'!T17:T19))","v":""},null,{"$f":"IF(C12=\"\",\"\",'7 Turnierleitung+Schiri'!O17)","v":""},null,{"$f":"IF(C12=\"\",\"\",SUM('7 Turnierleitung+Schiri'!P17:Q17))","v":""},null,{"$f":"IF(C12=\"\",\"\",SUM(H12,L12))","v":""}]
[null,3,{"$f":"IF('7 Turnierleitung+Schiri'!C20=\"\",\"\",'7 Turnierleitung+Schiri'!C20)","v":""},{"$f":"IF('7 Turnierleitung+Schiri'!D20=\"\",\"\",'7 Turnierleitung+Schiri'!D20)","v":""},null,null,null,{"$f":"IF(C13=\"\",\"\",SUM('7 Turnierleitung+Schiri'!T20:T22))","v":""},null,{"$f":"IF(C13=\"\",\"\",'7 Turnierleitung+Schiri'!O20)","v":""},null,{"$f":"IF(C13=\"\",\"\",SUM('7 Turnierleitung+Schiri'!P20:Q20))","v":""},null,""]
[null,4,{"$f":"IF('7 Turnierleitung+Schiri'!C23=\"\",\"\",'7 Turnierleitung+Schiri'!C23)","v":""},{"$f":"IF('7 Turnierleitung+Schiri'!D23=\"\",\"\",'7 Turnierleitung+Schiri'!D23)","v":""},null,null,null,{"$f":"IF(C14=\"\",\"\",SUM('7 Turnierleitung+Schiri'!T23:T25))","v":""},null,{"$f":"IF(C14=\"\",\"\",'7 Turnierleitung+Schiri'!O23)","v":""},null,{"$f":"IF(C14=\"\",\"\",SUM('7 Turnierleitung+Schiri'!P23:Q23))","v":""},null,""]
[null,5,{"$f":"IF('7 Turnierleitung+Schiri'!C26=\"\",\"\",'7 Turnierleitung+Schiri'!C26)","v":""},{"$f":"IF('7 Turnierleitung+Schiri'!D26=\"\",\"\",'7 Turnierleitung+Schiri'!D26)","v":""},null,null,null,{"$f":"IF(C15=\"\",\"\",SUM('7 Turnierleitung+Schiri'!T26:T27))","v":""},null,{"$f":"IF(C15=\"\",\"\",'7 Turnierleitung+Schiri'!O26)","v":""},null,{"$f":"IF(C15=\"\",\"\",SUM('7 Turnierleitung+Schiri'!P26:Q26))","v":""},null,""]
[null,6,{"$f":"IF('7 Turnierleitung+Schiri'!C28=\"\",\"\",'7 Turnierleitung+Schiri'!C28)","v":""},{"$f":"IF('7 Turnierleitung+Schiri'!D28=\"\",\"\",'7 Turnierleitung+Schiri'!D28)","v":""},null,null,null,{"$f":"IF(C16=\"\",\"\",SUM('7 Turnierleitung+Schiri'!T28:T29))","v":""},null,{"$f":"IF(C16=\"\",\"\",'7 Turnierleitung+Schiri'!O28)","v":""},null,{"$f":"IF(C16=\"\",\"\",SUM('7 Turnierleitung+Schiri'!P28:Q28))","v":""},null,""]
[null,7,{"$f":"IF('7 Turnierleitung+Schiri'!C30=\"\",\"\",'7 Turnierleitung+Schiri'!C30)","v":""},{"$f":"IF('7 Turnierleitung+Schiri'!D30=\"\",\"\",'7 Turnierleitung+Schiri'!D30)","v":""},null,null,null,{"$f":"IF(C17=\"\",\"\",SUM('7 Turnierleitung+Schiri'!T30:T31))","v":""},null,{"$f":"IF(C17=\"\",\"\",'7 Turnierleitung+Schiri'!O30)","v":""},null,{"$f":"IF(C17=\"\",\"\",SUM('7 Turnierleitung+Schiri'!P30:Q30))","v":""},null,""]
[null,8,{"$f":"IF('7 Turnierleitung+Schiri'!C32=\"\",\"\",'7 Turnierleitung+Schiri'!C32)","v":""},{"$f":"IF('7 Turnierleitung+Schiri'!D32=\"\",\"\",'7 Turnierleitung+Schiri'!D32)","v":""},null,null,null,{"$f":"IF(C18=\"\",\"\",SUM('7 Turnierleitung+Schiri'!T32:T33))","v":""},null,{"$f":"IF(C18=\"\",\"\",'7 Turnierleitung+Schiri'!O32)","v":""},null,{"$f":"IF(C18=\"\",\"\",SUM('7 Turnierleitung+Schiri'!P32:Q32))","v":""},null,""]
[null,9,{"$f":"IF('7 Turnierleitung+Schiri'!C34=\"\",\"\",'7 Turnierleitung+Schiri'!C34)","v":""},{"$f":"IF('7 Turnierleitung+Schiri'!D34=\"\",\"\",'7 Turnierleitung+Schiri'!D34)","v":""},null,null,null,{"$f":"IF(C19=\"\",\"\",SUM('7 Turnierleitung+Schiri'!T34:T35))","v":""},null,{"$f":"IF(C19=\"\",\"\",'7 Turnierleitung+Schiri'!O34)","v":""},null,{"$f":"IF(C19=\"\",\"\",SUM('7 Turnierleitung+Schiri'!P34:Q34))","v":""},null,""]
[null,10,{"$f":"IF('7 Turnierleitung+Schiri'!C36=\"\",\"\",'7 Turnierleitung+Schiri'!C36)","v":""},{"$f":"IF('7 Turnierleitung+Schiri'!D36=\"\",\"\",'7 Turnierleitung+Schiri'!D36)","v":""},null,null,null,{"$f":"IF(C20=\"\",\"\",SUM('7 Turnierleitung+Schiri'!T36:T37))","v":""},null,{"$f":"IF(C20=\"\",\"\",'7 Turnierleitung+Schiri'!O36)","v":""},null,{"$f":"IF(C20=\"\",\"\",SUM('7 Turnierleitung+Schiri'!P36:Q36))","v":""},null,""]
[null,11,{"$f":"IF('7 Turnierleitung+Schiri'!C38=\"\",\"\",'7 Turnierleitung+Schiri'!C38)","v":""},{"$f":"IF('7 Turnierleitung+Schiri'!D38=\"\",\"\",'7 Turnierleitung+Schiri'!D38)","v":""},null,null,null,{"$f":"IF(C21=\"\",\"\",SUM('7 Turnierleitung+Schiri'!T38:T39))","v":""},null,{"$f":"IF(C21=\"\",\"\",'7 Turnierleitung+Schiri'!O38)","v":""},null,{"$f":"IF(C21=\"\",\"\",SUM('7 Turnierleitung+Schiri'!P38:Q38))","v":""},null,""]
[null,12,{"$f":"IF('7 Turnierleitung+Schiri'!C40=\"\",\"\",'7 Turnierleitung+Schiri'!C40)","v":""},{"$f":"IF('7 Turnierleitung+Schiri'!D40=\"\",\"\",'7 Turnierleitung+Schiri'!D40)","v":""},null,null,null,{"$f":"IF(C22=\"\",\"\",SUM('7 Turnierleitung+Schiri'!T40:T41))","v":""},null,{"$f":"IF(C22=\"\",\"\",'7 Turnierleitung+Schiri'!O40)","v":""},null,{"$f":"IF(C22=\"\",\"\",SUM('7 Turnierleitung+Schiri'!P40:Q40))","v":""},null,""]
[null,13,{"$f":"IF('7 Turnierleitung+Schiri'!C42=\"\",\"\",'7 Turnierleitung+Schiri'!C42)","v":""},{"$f":"IF('7 Turnierleitung+Schiri'!D42=\"\",\"\",'7 Turnierleitung+Schiri'!D42)","v":""},null,null,null,{"$f":"IF(C23=\"\",\"\",SUM('7 Turnierleitung+Schiri'!T42:T43))","v":""},null,{"$f":"IF(C23=\"\",\"\",'7 Turnierleitung+Schiri'!O42)","v":""},null,{"$f":"IF(C23=\"\",\"\",SUM('7 Turnierleitung+Schiri'!P42:Q42))","v":""},null,""]
[null,14,{"$f":"IF('7 Turnierleitung+Schiri'!C44=\"\",\"\",'7 Turnierleitung+Schiri'!C44)","v":""},{"$f":"IF('7 Turnierleitung+Schiri'!D44=\"\",\"\",'7 Turnierleitung+Schiri'!D44)","v":""},null,null,null,{"$f":"IF(C24=\"\",\"\",SUM('7 Turnierleitung+Schiri'!T44:T45))","v":""},null,{"$f":"IF(C24=\"\",\"\",'7 Turnierleitung+Schiri'!O44)","v":""},null,{"$f":"IF(C24=\"\",\"\",SUM('7 Turnierleitung+Schiri'!P44:Q44))","v":""},null,""]
[null,15,{"$f":"IF('7 Turnierleitung+Schiri'!C46=\"\",\"\",'7 Turnierleitung+Schiri'!C46)","v":""},{"$f":"IF('7 Turnierleitung+Schiri'!D46=\"\",\"\",'7 Turnierleitung+Schiri'!D46)","v":""},null,null,null,{"$f":"IF(C25=\"\",\"\",'7 Turnierleitung+Schiri'!T46)","v":""},null,{"$f":"IF(C25=\"\",\"\",'7 Turnierleitung+Schiri'!O46)","v":""},null,{"$f":"IF(C25=\"\",\"\",SUM('7 Turnierleitung+Schiri'!P46:Q46))","v":""},null,""]
[null,16,{"$f":"IF('7 Turnierleitung+Schiri'!C47=\"\",\"\",'7 Turnierleitung+Schiri'!C47)","v":""},{"$f":"IF('7 Turnierleitung+Schiri'!D47=\"\",\"\",'7 Turnierleitung+Schiri'!D47)","v":""},null,null,null,{"$f":"IF(C26=\"\",\"\",'7 Turnierleitung+Schiri'!T47)","v":""},null,{"$f":"IF(C26=\"\",\"\",'7 Turnierleitung+Schiri'!O47)","v":""},null,{"$f":"IF(C26=\"\",\"\",SUM('7 Turnierleitung+Schiri'!P47:Q47))","v":""},null,""]
[null,17,{"$f":"IF('7 Turnierleitung+Schiri'!C48=\"\",\"\",'7 Turnierleitung+Schiri'!C48)","v":""},{"$f":"IF('7 Turnierleitung+Schiri'!D48=\"\",\"\",'7 Turnierleitung+Schiri'!D48)","v":""},null,null,null,{"$f":"IF(C27=\"\",\"\",'7 Turnierleitung+Schiri'!T48)","v":""},null,{"$f":"IF(C27=\"\",\"\",'7 Turnierleitung+Schiri'!O48)","v":""},null,{"$f":"IF(C27=\"\",\"\",SUM('7 Turnierleitung+Schiri'!P48:Q48))","v":""},null,""]
[null,18,{"$f":"IF('7 Turnierleitung+Schiri'!C49=\"\",\"\",'7 Turnierleitung+Schiri'!C49)","v":""},{"$f":"IF('7 Turnierleitung+Schiri'!D49=\"\",\"\",'7 Turnierleitung+Schiri'!D49)","v":""},null,null,null,{"$f":"IF(C28=\"\",\"\",'7 Turnierleitung+Schiri'!T49)","v":""},null,{"$f":"IF(C28=\"\",\"\",'7 Turnierleitung+Schiri'!O49)","v":""},null,{"$f":"IF(C28=\"\",\"\",SUM('7 Turnierleitung+Schiri'!P49:Q49))","v":""},null,""]
[null,19,{"$f":"IF('7 Turnierleitung+Schiri'!C50=\"\",\"\",'7 Turnierleitung+Schiri'!C50)","v":""},{"$f":"IF('7 Turnierleitung+Schiri'!D50=\"\",\"\",'7 Turnierleitung+Schiri'!D50)","v":""},null,null,null,{"$f":"IF(C29=\"\",\"\",'7 Turnierleitung+Schiri'!T50)","v":""},null,{"$f":"IF(C29=\"\",\"\",'7 Turnierleitung+Schiri'!O50)","v":""},null,{"$f":"IF(C29=\"\",\"\",SUM('7 Turnierleitung+Schiri'!P50:Q50))","v":""},null,""]
[null,20,{"$f":"IF('7 Turnierleitung+Schiri'!C51=\"\",\"\",'7 Turnierleitung+Schiri'!C51)","v":""},{"$f":"IF('7 Turnierleitung+Schiri'!D51=\"\",\"\",'7 Turnierleitung+Schiri'!D51)","v":""},null,null,null,{"$f":"IF(C30=\"\",\"\",'7 Turnierleitung+Schiri'!T51)","v":""},null,{"$f":"IF(C30=\"\",\"\",'7 Turnierleitung+Schiri'!O51)","v":""},null,{"$f":"IF(C30=\"\",\"\",SUM('7 Turnierleitung+Schiri'!P51:Q51))","v":""},null,""]
[null,21,{"$f":"IF('7 Turnierleitung+Schiri'!C52=\"\",\"\",'7 Turnierleitung+Schiri'!C52)","v":""},{"$f":"IF('7 Turnierleitung+Schiri'!D52=\"\",\"\",'7 Turnierleitung+Schiri'!D52)","v":""},null,null,null,{"$f":"IF(C31=\"\",\"\",'7 Turnierleitung+Schiri'!T52)","v":""},null,{"$f":"IF(C31=\"\",\"\",'7 Turnierleitung+Schiri'!O52)","v":""},null,{"$f":"IF(C31=\"\",\"\",SUM('7 Turnierleitung+Schiri'!P52:Q52))","v":""},null,""]
[null,22,{"$f":"IF('7 Turnierleitung+Schiri'!C53=\"\",\"\",'7 Turnierleitung+Schiri'!C53)","v":""},{"$f":"IF('7 Turnierleitung+Schiri'!D53=\"\",\"\",'7 Turnierleitung+Schiri'!D53)","v":""},null,null,null,{"$f":"IF(C32=\"\",\"\",'7 Turnierleitung+Schiri'!T53)","v":""},null,{"$f":"IF(C32=\"\",\"\",'7 Turnierleitung+Schiri'!O53)","v":""},null,{"$f":"IF(C32=\"\",\"\",SUM('7 Turnierleitung+Schiri'!P53:Q53))","v":""},null,""]
[null,23,{"$f":"IF('7 Turnierleitung+Schiri'!C54=\"\",\"\",'7 Turnierleitung+Schiri'!C54)","v":""},{"$f":"IF('7 Turnierleitung+Schiri'!D54=\"\",\"\",'7 Turnierleitung+Schiri'!D54)","v":""},null,null,null,{"$f":"IF(C33=\"\",\"\",'7 Turnierleitung+Schiri'!T54)","v":""},null,{"$f":"IF(C33=\"\",\"\",'7 Turnierleitung+Schiri'!O54)","v":""},null,{"$f":"IF(C33=\"\",\"\",SUM('7 Turnierleitung+Schiri'!P54:Q54))","v":""},null,""]
[null,24,{"$f":"IF('7 Turnierleitung+Schiri'!C55=\"\",\"\",'7 Turnierleitung+Schiri'!C55)","v":""},{"$f":"IF('7 Turnierleitung+Schiri'!D55=\"\",\"\",'7 Turnierleitung+Schiri'!D55)","v":""},null,null,null,{"$f":"IF(C34=\"\",\"\",'7 Turnierleitung+Schiri'!T55)","v":""},null,{"$f":"IF(C34=\"\",\"\",'7 Turnierleitung+Schiri'!O55)","v":""},null,{"$f":"IF(C34=\"\",\"\",SUM('7 Turnierleitung+Schiri'!P55:Q55))","v":""},null,""]
[null,25,{"$f":"IF('7 Turnierleitung+Schiri'!C56=\"\",\"\",'7 Turnierleitung+Schiri'!C56)","v":""},{"$f":"IF('7 Turnierleitung+Schiri'!D56=\"\",\"\",'7 Turnierleitung+Schiri'!D56)","v":""},null,null,null,{"$f":"IF(C35=\"\",\"\",'7 Turnierleitung+Schiri'!T56)","v":""},null,{"$f":"IF(C35=\"\",\"\",'7 Turnierleitung+Schiri'!O56)","v":""},null,{"$f":"IF(C35=\"\",\"\",SUM('7 Turnierleitung+Schiri'!P56:Q56))","v":""},null,""]
[]
[null,null,"Empfangsblatt: Turnierleitung und Schiedsrichter ",null,null,null,null,null,"Veranstaltung:",null,{"$f":"IF(Veranstaltung=\"\",\"\",Veranstaltung)","v":""},null,null,null,null,null,null,"Blatt:","2"]
[null,"Nr.","Name","Wohnort","----- Reisezeit -----",null,null,"Tagegeld",null,"Fahrgeld   (wenn Fahrer) + Öff.VkM",null,null,null,"Summe",null,"Anmerkung und\nSonstiges",null,"Unterschrift"]
[null,null,null,null,"von","bis","Dauer","Kalk.","Ist","Strecke  [km]",null,"Kalk.","Ist","Kalk.","Ist"]
[null,null,null,null,null,null,null,"€","€","Kalk.","Ist","€","€","€","€"]
[null,26,{"$f":"IF('7 Turnierleitung+Schiri'!C57=\"\",\"\",'7 Turnierleitung+Schiri'!C57)","v":""},{"$f":"IF('7 Turnierleitung+Schiri'!D57=\"\",\"\",'7 Turnierleitung+Schiri'!D57)","v":""},null,null,null,{"$f":"IF(C41=\"\",\"\",'7 Turnierleitung+Schiri'!T57)","v":""},null,{"$f":"IF(C41=\"\",\"\",'7 Turnierleitung+Schiri'!O57)","v":""},null,{"$f":"IF(C41=\"\",\"\",SUM('7 Turnierleitung+Schiri'!P57:Q57))","v":""},null,{"$f":"IF(C41=\"\",\"\",SUM(H41,L41))","v":""}]
[null,27,{"$f":"IF('7 Turnierleitung+Schiri'!C58=\"\",\"\",'7 Turnierleitung+Schiri'!C58)","v":""},{"$f":"IF('7 Turnierleitung+Schiri'!D58=\"\",\"\",'7 Turnierleitung+Schiri'!D58)","v":""},null,null,null,{"$f":"IF(C42=\"\",\"\",'7 Turnierleitung+Schiri'!T58)","v":""},null,{"$f":"IF(C42=\"\",\"\",'7 Turnierleitung+Schiri'!O58)","v":""},null,{"$f":"IF(C42=\"\",\"\",SUM('7 Turnierleitung+Schiri'!P58:Q58))","v":""},null,{"$f":"IF(C42=\"\",\"\",SUM(H42,L42))","v":""}]
[null,28,{"$f":"IF('7 Turnierleitung+Schiri'!C59=\"\",\"\",'7 Turnierleitung+Schiri'!C59)","v":""},{"$f":"IF('7 Turnierleitung+Schiri'!D59=\"\",\"\",'7 Turnierleitung+Schiri'!D59)","v":""},null,null,null,{"$f":"IF(C43=\"\",\"\",'7 Turnierleitung+Schiri'!T59)","v":""},null,{"$f":"IF(C43=\"\",\"\",'7 Turnierleitung+Schiri'!O59)","v":""},null,{"$f":"IF(C43=\"\",\"\",SUM('7 Turnierleitung+Schiri'!P59:Q59))","v":""},null,""]
[null,29,{"$f":"IF('7 Turnierleitung+Schiri'!C60=\"\",\"\",'7 Turnierleitung+Schiri'!C60)","v":""},{"$f":"IF('7 Turnierleitung+Schiri'!D60=\"\",\"\",'7 Turnierleitung+Schiri'!D60)","v":""},null,null,null,{"$f":"IF(C44=\"\",\"\",'7 Turnierleitung+Schiri'!T60)","v":""},null,{"$f":"IF(C44=\"\",\"\",'7 Turnierleitung+Schiri'!O60)","v":""},null,{"$f":"IF(C44=\"\",\"\",SUM('7 Turnierleitung+Schiri'!P60:Q60))","v":""},null,""]
[null,30,{"$f":"IF('7 Turnierleitung+Schiri'!C61=\"\",\"\",'7 Turnierleitung+Schiri'!C61)","v":""},{"$f":"IF('7 Turnierleitung+Schiri'!D61=\"\",\"\",'7 Turnierleitung+Schiri'!D61)","v":""},null,null,null,{"$f":"IF(C45=\"\",\"\",'7 Turnierleitung+Schiri'!T61)","v":""},null,{"$f":"IF(C45=\"\",\"\",'7 Turnierleitung+Schiri'!O61)","v":""},null,{"$f":"IF(C45=\"\",\"\",SUM('7 Turnierleitung+Schiri'!P61:Q61))","v":""},null,""]
[null,31,{"$f":"IF('7 Turnierleitung+Schiri'!C62=\"\",\"\",'7 Turnierleitung+Schiri'!C62)","v":""},{"$f":"IF('7 Turnierleitung+Schiri'!D62=\"\",\"\",'7 Turnierleitung+Schiri'!D62)","v":""},null,null,null,{"$f":"IF(C46=\"\",\"\",'7 Turnierleitung+Schiri'!T62)","v":""},null,{"$f":"IF(C46=\"\",\"\",'7 Turnierleitung+Schiri'!O62)","v":""},null,{"$f":"IF(C46=\"\",\"\",SUM('7 Turnierleitung+Schiri'!P62:Q62))","v":""},null,""]
[null,32,{"$f":"IF('7 Turnierleitung+Schiri'!C63=\"\",\"\",'7 Turnierleitung+Schiri'!C63)","v":""},{"$f":"IF('7 Turnierleitung+Schiri'!D63=\"\",\"\",'7 Turnierleitung+Schiri'!D63)","v":""},null,null,null,{"$f":"IF(C47=\"\",\"\",'7 Turnierleitung+Schiri'!T63)","v":""},null,{"$f":"IF(C47=\"\",\"\",'7 Turnierleitung+Schiri'!O63)","v":""},null,{"$f":"IF(C47=\"\",\"\",SUM('7 Turnierleitung+Schiri'!P63:Q63))","v":""},null,""]
[null,33,{"$f":"IF('7 Turnierleitung+Schiri'!C64=\"\",\"\",'7 Turnierleitung+Schiri'!C64)","v":""},{"$f":"IF('7 Turnierleitung+Schiri'!D64=\"\",\"\",'7 Turnierleitung+Schiri'!D64)","v":""},null,null,null,{"$f":"IF(C48=\"\",\"\",'7 Turnierleitung+Schiri'!T64)","v":""},null,{"$f":"IF(C48=\"\",\"\",'7 Turnierleitung+Schiri'!O64)","v":""},null,{"$f":"IF(C48=\"\",\"\",SUM('7 Turnierleitung+Schiri'!P64:Q64))","v":""},null,""]
[null,34,{"$f":"IF('7 Turnierleitung+Schiri'!C65=\"\",\"\",'7 Turnierleitung+Schiri'!C65)","v":""},{"$f":"IF('7 Turnierleitung+Schiri'!D65=\"\",\"\",'7 Turnierleitung+Schiri'!D65)","v":""},null,null,null,{"$f":"IF(C49=\"\",\"\",'7 Turnierleitung+Schiri'!T65)","v":""},null,{"$f":"IF(C49=\"\",\"\",'7 Turnierleitung+Schiri'!O65)","v":""},null,{"$f":"IF(C49=\"\",\"\",SUM('7 Turnierleitung+Schiri'!P65:Q65))","v":""},null,""]
[null,35,{"$f":"IF('7 Turnierleitung+Schiri'!C66=\"\",\"\",'7 Turnierleitung+Schiri'!C66)","v":""},{"$f":"IF('7 Turnierleitung+Schiri'!D66=\"\",\"\",'7 Turnierleitung+Schiri'!D66)","v":""},null,null,null,{"$f":"IF(C50=\"\",\"\",'7 Turnierleitung+Schiri'!T66)","v":""},null,{"$f":"IF(C50=\"\",\"\",'7 Turnierleitung+Schiri'!O66)","v":""},null,{"$f":"IF(C50=\"\",\"\",SUM('7 Turnierleitung+Schiri'!P66:Q66))","v":""},null,""]
[null,36,{"$f":"IF('7 Turnierleitung+Schiri'!C67=\"\",\"\",'7 Turnierleitung+Schiri'!C67)","v":""},{"$f":"IF('7 Turnierleitung+Schiri'!D67=\"\",\"\",'7 Turnierleitung+Schiri'!D67)","v":""},null,null,null,{"$f":"IF(C51=\"\",\"\",'7 Turnierleitung+Schiri'!T67)","v":""},null,{"$f":"IF(C51=\"\",\"\",'7 Turnierleitung+Schiri'!O67)","v":""},null,{"$f":"IF(C51=\"\",\"\",SUM('7 Turnierleitung+Schiri'!P67:Q67))","v":""},null,""]
[null,37,{"$f":"IF('7 Turnierleitung+Schiri'!C68=\"\",\"\",'7 Turnierleitung+Schiri'!C68)","v":""},{"$f":"IF('7 Turnierleitung+Schiri'!D68=\"\",\"\",'7 Turnierleitung+Schiri'!D68)","v":""},null,null,null,{"$f":"IF(C52=\"\",\"\",'7 Turnierleitung+Schiri'!T68)","v":""},null,{"$f":"IF(C52=\"\",\"\",'7 Turnierleitung+Schiri'!O68)","v":""},null,{"$f":"IF(C52=\"\",\"\",SUM('7 Turnierleitung+Schiri'!P68:Q68))","v":""},null,""]
[null,38,{"$f":"IF('7 Turnierleitung+Schiri'!C69=\"\",\"\",'7 Turnierleitung+Schiri'!C69)","v":""},{"$f":"IF('7 Turnierleitung+Schiri'!D69=\"\",\"\",'7 Turnierleitung+Schiri'!D69)","v":""},null,null,null,{"$f":"IF(C53=\"\",\"\",'7 Turnierleitung+Schiri'!T69)","v":""},null,{"$f":"IF(C53=\"\",\"\",'7 Turnierleitung+Schiri'!O69)","v":""},null,{"$f":"IF(C53=\"\",\"\",SUM('7 Turnierleitung+Schiri'!P69:Q69))","v":""},null,""]
[null,39,{"$f":"IF('7 Turnierleitung+Schiri'!C70=\"\",\"\",'7 Turnierleitung+Schiri'!C70)","v":""},{"$f":"IF('7 Turnierleitung+Schiri'!D70=\"\",\"\",'7 Turnierleitung+Schiri'!D70)","v":""},null,null,null,{"$f":"IF(C54=\"\",\"\",'7 Turnierleitung+Schiri'!T70)","v":""},null,{"$f":"IF(C54=\"\",\"\",'7 Turnierleitung+Schiri'!O70)","v":""},null,{"$f":"IF(C54=\"\",\"\",SUM('7 Turnierleitung+Schiri'!P70:Q70))","v":""},null,""]
[null,40,{"$f":"IF('7 Turnierleitung+Schiri'!C71=\"\",\"\",'7 Turnierleitung+Schiri'!C71)","v":""},{"$f":"IF('7 Turnierleitung+Schiri'!D71=\"\",\"\",'7 Turnierleitung+Schiri'!D71)","v":""},null,null,null,{"$f":"IF(C55=\"\",\"\",'7 Turnierleitung+Schiri'!T71)","v":""},null,{"$f":"IF(C55=\"\",\"\",'7 Turnierleitung+Schiri'!O71)","v":""},null,{"$f":"IF(C55=\"\",\"\",SUM('7 Turnierleitung+Schiri'!P71:Q71))","v":""},null,""]
[null,41,{"$f":"IF('7 Turnierleitung+Schiri'!C72=\"\",\"\",'7 Turnierleitung+Schiri'!C72)","v":""},{"$f":"IF('7 Turnierleitung+Schiri'!D72=\"\",\"\",'7 Turnierleitung+Schiri'!D72)","v":""},null,null,null,{"$f":"IF(C56=\"\",\"\",'7 Turnierleitung+Schiri'!T72)","v":""},null,{"$f":"IF(C56=\"\",\"\",'7 Turnierleitung+Schiri'!O72)","v":""},null,{"$f":"IF(C56=\"\",\"\",SUM('7 Turnierleitung+Schiri'!P72:Q72))","v":""},null,""]
[null,42,{"$f":"IF('7 Turnierleitung+Schiri'!C73=\"\",\"\",'7 Turnierleitung+Schiri'!C73)","v":""},{"$f":"IF('7 Turnierleitung+Schiri'!D73=\"\",\"\",'7 Turnierleitung+Schiri'!D73)","v":""},null,null,null,{"$f":"IF(C57=\"\",\"\",'7 Turnierleitung+Schiri'!T73)","v":""},null,{"$f":"IF(C57=\"\",\"\",'7 Turnierleitung+Schiri'!O73)","v":""},null,{"$f":"IF(C57=\"\",\"\",SUM('7 Turnierleitung+Schiri'!P73:Q73))","v":""},null,""]
[null,43,{"$f":"IF('7 Turnierleitung+Schiri'!C74=\"\",\"\",'7 Turnierleitung+Schiri'!C74)","v":""},{"$f":"IF('7 Turnierleitung+Schiri'!D74=\"\",\"\",'7 Turnierleitung+Schiri'!D74)","v":""},null,null,null,{"$f":"IF(C58=\"\",\"\",'7 Turnierleitung+Schiri'!T74)","v":""},null,{"$f":"IF(C58=\"\",\"\",'7 Turnierleitung+Schiri'!O74)","v":""},null,{"$f":"IF(C58=\"\",\"\",SUM('7 Turnierleitung+Schiri'!P74:Q74))","v":""},null,""]
[null,44,{"$f":"IF('7 Turnierleitung+Schiri'!C75=\"\",\"\",'7 Turnierleitung+Schiri'!C75)","v":""},{"$f":"IF('7 Turnierleitung+Schiri'!D75=\"\",\"\",'7 Turnierleitung+Schiri'!D75)","v":""},null,null,null,{"$f":"IF(C59=\"\",\"\",'7 Turnierleitung+Schiri'!T75)","v":""},null,{"$f":"IF(C59=\"\",\"\",'7 Turnierleitung+Schiri'!O75)","v":""},null,{"$f":"IF(C59=\"\",\"\",SUM('7 Turnierleitung+Schiri'!P75:Q75))","v":""},null,""]
[null,45,{"$f":"IF('7 Turnierleitung+Schiri'!C76=\"\",\"\",'7 Turnierleitung+Schiri'!C76)","v":""},{"$f":"IF('7 Turnierleitung+Schiri'!D76=\"\",\"\",'7 Turnierleitung+Schiri'!D76)","v":""},null,null,null,{"$f":"IF(C60=\"\",\"\",'7 Turnierleitung+Schiri'!T76)","v":""},null,{"$f":"IF(C60=\"\",\"\",'7 Turnierleitung+Schiri'!O76)","v":""},null,{"$f":"IF(C60=\"\",\"\",SUM('7 Turnierleitung+Schiri'!P76:Q76))","v":""},null,""]
[null,46,{"$f":"IF('7 Turnierleitung+Schiri'!C77=\"\",\"\",'7 Turnierleitung+Schiri'!C77)","v":""},{"$f":"IF('7 Turnierleitung+Schiri'!D77=\"\",\"\",'7 Turnierleitung+Schiri'!D77)","v":""},null,null,null,{"$f":"IF(C61=\"\",\"\",'7 Turnierleitung+Schiri'!T77)","v":""},null,{"$f":"IF(C61=\"\",\"\",'7 Turnierleitung+Schiri'!O77)","v":""},null,{"$f":"IF(C61=\"\",\"\",SUM('7 Turnierleitung+Schiri'!P77:Q77))","v":""},null,""]
[null,47,{"$f":"IF('7 Turnierleitung+Schiri'!C78=\"\",\"\",'7 Turnierleitung+Schiri'!C78)","v":""},{"$f":"IF('7 Turnierleitung+Schiri'!D78=\"\",\"\",'7 Turnierleitung+Schiri'!D78)","v":""},null,null,null,{"$f":"IF(C62=\"\",\"\",'7 Turnierleitung+Schiri'!T78)","v":""},null,{"$f":"IF(C62=\"\",\"\",'7 Turnierleitung+Schiri'!O78)","v":""},null,{"$f":"IF(C62=\"\",\"\",SUM('7 Turnierleitung+Schiri'!P78:Q78))","v":""},null,""]
[null,48,{"$f":"IF('7 Turnierleitung+Schiri'!C79=\"\",\"\",'7 Turnierleitung+Schiri'!C79)","v":""},{"$f":"IF('7 Turnierleitung+Schiri'!D79=\"\",\"\",'7 Turnierleitung+Schiri'!D79)","v":""},null,null,null,{"$f":"IF(C63=\"\",\"\",'7 Turnierleitung+Schiri'!T79)","v":""},null,{"$f":"IF(C63=\"\",\"\",'7 Turnierleitung+Schiri'!O79)","v":""},null,{"$f":"IF(C63=\"\",\"\",SUM('7 Turnierleitung+Schiri'!P79:Q79))","v":""},null,""]
[null,49,{"$f":"IF('7 Turnierleitung+Schiri'!C80=\"\",\"\",'7 Turnierleitung+Schiri'!C80)","v":""},{"$f":"IF('7 Turnierleitung+Schiri'!D80=\"\",\"\",'7 Turnierleitung+Schiri'!D80)","v":""},null,null,null,{"$f":"IF(C64=\"\",\"\",'7 Turnierleitung+Schiri'!T80)","v":""},null,{"$f":"IF(C64=\"\",\"\",'7 Turnierleitung+Schiri'!O80)","v":""},null,{"$f":"IF(C64=\"\",\"\",SUM('7 Turnierleitung+Schiri'!P80:Q80))","v":""},null,""]
[null,50,{"$f":"IF('7 Turnierleitung+Schiri'!C81=\"\",\"\",'7 Turnierleitung+Schiri'!C81)","v":""},{"$f":"IF('7 Turnierleitung+Schiri'!D81=\"\",\"\",'7 Turnierleitung+Schiri'!D81)","v":""},null,null,null,{"$f":"IF(C65=\"\",\"\",'7 Turnierleitung+Schiri'!T81)","v":""},null,{"$f":"IF(C65=\"\",\"\",'7 Turnierleitung+Schiri'!O81)","v":""},null,{"$f":"IF(C65=\"\",\"\",SUM('7 Turnierleitung+Schiri'!P81:Q81))","v":""},null,""]
[null,51,{"$f":"IF('7 Turnierleitung+Schiri'!C82=\"\",\"\",'7 Turnierleitung+Schiri'!C82)","v":""},{"$f":"IF('7 Turnierleitung+Schiri'!D82=\"\",\"\",'7 Turnierleitung+Schiri'!D82)","v":""},null,null,null,{"$f":"IF(C66=\"\",\"\",'7 Turnierleitung+Schiri'!T82)","v":""},null,{"$f":"IF(C66=\"\",\"\",'7 Turnierleitung+Schiri'!O82)","v":""},null,{"$f":"IF(C66=\"\",\"\",SUM('7 Turnierleitung+Schiri'!P82:Q82))","v":""},null,""]
[null,52,{"$f":"IF('7 Turnierleitung+Schiri'!C83=\"\",\"\",'7 Turnierleitung+Schiri'!C83)","v":""},{"$f":"IF('7 Turnierleitung+Schiri'!D83=\"\",\"\",'7 Turnierleitung+Schiri'!D83)","v":""},null,null,null,{"$f":"IF(C67=\"\",\"\",'7 Turnierleitung+Schiri'!T83)","v":""},null,{"$f":"IF(C67=\"\",\"\",'7 Turnierleitung+Schiri'!O83)","v":""},null,{"$f":"IF(C67=\"\",\"\",SUM('7 Turnierleitung+Schiri'!P83:Q83))","v":""},null,""]
[null,53,{"$f":"IF('7 Turnierleitung+Schiri'!C84=\"\",\"\",'7 Turnierleitung+Schiri'!C84)","v":""},{"$f":"IF('7 Turnierleitung+Schiri'!D84=\"\",\"\",'7 Turnierleitung+Schiri'!D84)","v":""},null,null,null,{"$f":"IF(C68=\"\",\"\",'7 Turnierleitung+Schiri'!T84)","v":""},null,{"$f":"IF(C68=\"\",\"\",'7 Turnierleitung+Schiri'!O84)","v":""},null,{"$f":"IF(C68=\"\",\"\",SUM('7 Turnierleitung+Schiri'!P84:Q84))","v":""},null,""]
[null,54,{"$f":"IF('7 Turnierleitung+Schiri'!C85=\"\",\"\",'7 Turnierleitung+Schiri'!C85)","v":""},{"$f":"IF('7 Turnierleitung+Schiri'!D85=\"\",\"\",'7 Turnierleitung+Schiri'!D85)","v":""},null,null,null,{"$f":"IF(C69=\"\",\"\",'7 Turnierleitung+Schiri'!T85)","v":""},null,{"$f":"IF(C69=\"\",\"\",'7 Turnierleitung+Schiri'!O85)","v":""},null,{"$f":"IF(C69=\"\",\"\",SUM('7 Turnierleitung+Schiri'!P85:Q85))","v":""},null,""]
[null,"Summe",null,null,null,null,null,{"$f":"SUM(H11:H35,H41:H69)","v":0},null,{"$f":"SUM(J11:J35,J41:J69)","v":0},null,{"$f":"SUM(L11:L35,L41:L69)","v":0},null,{"$f":"SUM(N11:N35,N41:N69)","v":0}]

{"sheet":"10 Auszahl-Beschein","index":9,"n_rows":342,"n_cols":13,"rows_kept":342,"cut":false,"hidden":false,"merged":[[289,1,289,7],[292,1,292,7],[219,5,219,6],[273,1,273,7],[288,1,288,6],[275,5,275,6],[280,6,280,7],[281,6,281,7],[282,6,282,7],[251,1,251,7],[240,5,240,6],[242,6,242,7],[243,6,243,7],[241,1,241,7],[286,1,287,6],[279,1,279,7],[283,1,283,7],[280,1,282,2],[276,5,276,6],[244,6,244,7],[260,1,260,7],[261,1,263,2],[271,2,271,7],[267,1,268,6],[300,6,300,7],[301,6,301,7],[290,2,290,7],[297,5,297,6],[291,5,291,7],[298,1,298,7],[302,1,302,7],[299,1,301,2],[166,1,168,2],[169,1,169,7],[203,1,203,7],[207,1,207,7],[222,1,222,7],[221,5,221,6],[182,5,182,6],[299,6,299,7],[262,6,262,7],[277,5,277,6],[293,5,293,6],[294,5,294,6],[295,5,295,6],[296,5,296,6],[274,5,274,6],[278,5,278,6],[12,5,12,6],[16,6,16,7],[15,6,15,7],[14,6,14,7],[54,6,54,7],[26,1,26,7],[30,5,30,6],[25,5,25,7],[27,5,27,6],[28,5,28,6],[49,5,49,6],[34,6,34,7],[35,6,35,7],[269,1,269,6],[87,5,87,6],[88,5,88,6],[90,6,90,7],[91,6,91,7],[92,6,92,7],[96,1,97,6],[89,1,89,7],[93,1,93,7],[90,1,92,2],[107,5,107,6],[98,1,98,6],[101,5,101,7],[99,1,99,7],[102,1,102,7],[103,5,103,6],[104,5,104,6],[105,5,105,6],[100,2,100,7],[106,5,106,6],[204,6,204,7],[205,6,205,7],[206,6,206,7],[210,1,211,6],[272,5,272,7],[270,1,270,7],[263,6,263,7],[264,1,264,7],[239,5,239,6],[233,2,233,7],[229,1,230,6],[231,1,231,6],[234,5,234,7],[235,1,235,7],[236,5,236,6],[232,1,232,7],[245,1,245,7],[242,1,244,2],[259,5,259,6],[261,6,261,7],[254,1,254,7],[257,5,257,6],[258,5,258,6],[255,5,255,6],[252,2,252,7],[248,1,249,6],[250,1,250,6],[253,5,253,7],[204,1,206,2],[213,1,213,7],[216,1,216,7],[237,5,237,6],[238,5,238,6],[226,1,226,7],[223,1,225,2],[212,1,212,6],[214,2,214,7],[217,5,217,6],[218,5,218,6],[215,5,215,7],[223,6,223,7],[224,6,224,7],[225,6,225,7],[220,5,220,6],[185,6,185,7],[186,6,186,7],[187,6,187,7],[191,1,192,6],[184,1,184,7],[185,1,187,2],[188,1,188,7],[195,2,195,7],[202,5,202,6],[193,1,193,6],[196,5,196,7],[194,1,194,7],[197,1,197,7],[198,5,198,6],[199,5,199,6],[200,5,200,6],[201,5,201,6],[145,5,145,6],[179,5,179,6],[180,5,180,6],[181,5,181,6],[183,5,183,6],[176,2,176,7],[172,1,173,6],[174,1,174,6],[177,5,177,7],[175,1,175,7],[155,1,155,6],[158,5,158,7],[178,1,178,7],[163,5,163,6],[164,5,164,6],[166,6,166,7],[167,6,167,7],[168,6,168,7],[165,1,165,7],[138,2,138,7],[134,1,135,6],[136,1,136,6],[131,1,131,7],[128,1,130,2],[137,1,137,7],[161,5,161,6],[142,5,142,6],[143,5,143,6],[140,1,140,7],[146,1,146,7],[150,1,150,7],[156,1,156,7],[159,1,159,7],[147,1,149,2],[141,5,141,6],[139,5,139,7],[147,6,147,7],[148,6,148,7],[149,6,149,7],[157,2,157,7],[160,5,160,6],[144,5,144,6],[153,1,154,6],[61,1,61,8],[52,6,52,7],[53,6,53,7],[41,1,41,6],[70,1,70,7],[74,1,74,7],[71,1,73,2],[67,5,67,6],[68,5,68,6],[69,5,69,6],[71,6,71,7],[72,6,72,7],[43,2,43,7],[44,5,44,7],[50,5,50,6],[58,1,59,6],[46,5,46,6],[48,5,48,6],[60,1,60,6],[42,1,42,7],[45,1,45,7],[51,1,51,7],[52,1,54,2],[55,1,55,7],[125,5,125,6],[121,1,121,7],[79,1,79,6],[1,1,2,6],[3,1,3,6],[20,1,21,6],[22,1,22,6],[36,1,36,7],[33,1,35,2],[29,5,29,6],[31,5,31,6],[24,2,24,7],[6,2,6,3],[14,1,16,2],[4,1,4,7],[7,1,7,7],[13,1,13,7],[23,1,23,7],[6,5,6,7],[5,2,5,7],[8,5,8,6],[9,5,9,6],[11,5,11,6],[33,6,33,7],[82,5,82,7],[80,1,80,7],[83,1,83,7],[84,5,84,6],[85,5,85,6],[86,5,86,6],[124,5,124,6],[65,5,65,6],[66,5,66,6],[108,1,108,7],[112,1,112,7],[109,1,111,2],[118,1,118,7],[81,2,81,7],[77,1,78,6],[10,5,10,6],[17,1,17,7],[39,1,40,6],[256,5,256,6],[47,5,47,6],[64,1,64,7],[62,2,62,7],[63,5,63,7],[127,1,127,7],[117,1,117,6],[119,2,119,7],[126,5,126,6],[120,5,120,7],[109,6,109,7],[110,6,110,7],[111,6,111,7],[115,1,116,6],[122,5,122,6],[123,5,123,6],[128,6,128,7],[129,6,129,7],[130,6,130,7],[73,6,73,7],[162,5,162,6]]}
[null,null,null,null,null,null,null,null,null,null,45,41,-4]
[null,"Tischtennis Baden-Württemberg e.V.",null,null,null,null,null,null,null,null,null,10]
[null,null,null,null,null,null,null,{"$f":"IF(Kostenstelle=\"\",\"\",Kostenstelle)","v":""},null,null,null,30]
[null,"Auszahlungs-Bescheinigung",null,null,null,null,null,"Kostenstelle",null,null,null,30]
[null,null,null,null,null,null,null,null,null,null,null,10]
[null,"Veranstaltung:",{"$f":"IF(Veranstaltung=\"\",\"\",Veranstaltung)","v":""},null,null,null,null,null,null,null,null,24]
[null,"Ort:",{"$f":"IF(Ort=\"\",\"\",Ort)","v":""},null,"Datum:",{"$f":"IF(Datum=\"\",\"\",Datum)","v":""},null,null,null,null,null,32]
[null,null,null,null,null,null,null,null,null,null,null,30]
[null,"Empfänger:",null,null,"Fahrkosten:",{"$f":"SUM('3 Auszahlung-Zusammenst'!G11,'3 Auszahlung-Zusammenst'!I11)","v":0},null,null,null,null,null,24]
[null,"Name, Vorname:",{"$f":"'3 Auszahlung-Zusammenst'!C11","v":"LSV"},null,"Tagegeld:",{"$f":"SUM('3 Auszahlung-Zusammenst'!K11)","v":0},null,null,null,null,null,24]
[null,"Wohnort:",{"$f":"'3 Auszahlung-Zusammenst'!D11","v":""},null,"Honorar:",{"$f":"SUM('3 Auszahlung-Zusammenst'!M11)","v":0},null,null,null,null,24,25]
[null,null,null,null,"Sonstige Auslagen:",{"$f":"SUM('3 Auszahlung-Zusammenst'!O11)","v":0},null,null,null,null,24,26]
[null,null,null,null,"Summe:",{"$f":"SUM('3 Auszahlung-Zusammenst'!Q11)","v":0},null,null,null,null,24,27]
[null,null,null,null,null,null,null,null,null,null,40,32,-8]
[null,"Mit der Unterschrift auf dem Sammel-Empfangsblatt wird versichert, dass die steuerrechtlichen Vorschriften nach dem EStG beachtet werden.",null,null,{"$f":"IF('1 Deckblatt St.2024-04-09'!$J$57=\"\",\"\",'1 Deckblatt St.2024-04-09'!$J$57)","v":""},null,null,null,null,null,32,32]
[null,null,null,null,null,null,null,null,null,null,null,8]
[null,null,null,null,"(Datum)",null,"(Unterschrift TTBW)",null,null,null,null,14]
[null,null,null,null,null,null,null,null,null,null,null,14]
[null,null,null,null,null,null,null,null,null,null,80,76,-4]
[null,null,null,null,null,null,null,null,null,null,95,91,-4]
[null,"Tischtennis Baden-Württemberg e.V.",null,null,null,null,null,null,null,null,null,10]
[null,null,null,null,null,null,null,{"$f":"IF(Kostenstelle=\"\",\"\",Kostenstelle)","v":""},null,null,null,30]
[null,"Auszahlungs-Bescheinigung",null,null,null,null,null,"Kostenstelle",null,null,null,30]
[null,null,null,null,null,null,null,null,null,null,null,10]
[null,"Veranstaltung:",{"$f":"IF(Veranstaltung=\"\",\"\",Veranstaltung)","v":""},null,null,null,null,null,null,null,null,24]
[null,"Ort:",{"$f":"IF(Ort=\"\",\"\",Ort)","v":""},null,"Datum:",{"$f":"IF(Datum=\"\",\"\",Datum)","v":""},null,null,null,null,null,32]
[null,null,null,null,null,null,null,null,null,null,null,30]
[null,"Empfänger:",null,null,"Fahrkosten:",{"$f":"SUM('3 Auszahlung-Zusammenst'!G12,'3 Auszahlung-Zusammenst'!I12)","v":0},null,null,null,null,null,24]
[null,"Name, Vorname:",{"$f":"'3 Auszahlung-Zusammenst'!C12","v":"LSV"},null,"Tagegeld:",{"$f":"SUM('3 Auszahlung-Zusammenst'!K12)","v":0},null,null,null,null,null,24]
[null,"Wohnort:",{"$f":"'3 Auszahlung-Zusammenst'!D12","v":""},null,"Honorar:",{"$f":"SUM('3 Auszahlung-Zusammenst'!M12)","v":0},null,null,null,null,24,24]
[null,null,null,null,"Sonstige Auslagen:",{"$f":"SUM('3 Auszahlung-Zusammenst'!O12)","v":0},null,null,null,null,24,24]
[null,null,null,null,"Summe:",{"$f":"SUM('3 Auszahlung-Zusammenst'!Q12)","v":0},null,null,null,null,24,24]
[null,null,null,null,null,null,null,null,null,null,40,32,-8]
[null,"Mit der Unterschrift auf dem Sammel-Empfangsblatt wird versichert, dass die steuerrechtlichen Vorschriften nach dem EStG beachtet werden.",null,null,{"$f":"IF('1 Deckblatt St.2024-04-09'!$J$57=\"\",\"\",'1 Deckblatt St.2024-04-09'!$J$57)","v":""},null,null,null,null,null,32,32]
[null,null,null,null,null,null,null,null,null,null,null,8]
[null,null,null,null,"(Datum)",null,"(Unterschrift TTBW)",null,null,null,null,14]
[null,null,null,null,null,null,null,null,null,null,null,14]
[null,null,null,null,null,null,null,null,null,null,24,20,-4]
[null,null,null,null,null,null,null,null,null,null,45,41,-4]
[null,"Tischtennis Baden-Württemberg e.V.",null,null,null,null,null,null,null,null,null,10]
[null,null,null,null,null,null,null,{"$f":"IF(Kostenstelle=\"\",\"\",Kostenstelle)","v":""},null,null,null,30]
[null,"Auszahlungs-Bescheinigung",null,null,null,null,null,"Kostenstelle",null,null,null,30]
[null,null,null,null,null,null,null,null,null,null,null,10]
[null,"Veranstaltung:",{"$f":"IF(Veranstaltung=\"\",\"\",Veranstaltung)","v":""},null,null,null,null,null,null,null,null,24]
[null,"Ort:",{"$f":"IF(Ort=\"\",\"\",Ort)","v":""},null,"Datum:",{"$f":"IF(Datum=\"\",\"\",Datum)","v":""},null,null,null,null,null,32]
[null,null,null,null,null,null,null,null,null,null,null,30]
[null,"Empfänger:",null,null,"Fahrkosten:",{"$f":"SUM('3 Auszahlung-Zusammenst'!G13,'3 Auszahlung-Zusammenst'!I13)","v":0},null,null,null,null,null,24]
[null,"Name, Vorname:",{"$f":"'3 Auszahlung-Zusammenst'!C13","v":"LSV"},null,"Tagegeld:",{"$f":"SUM('3 Auszahlung-Zusammenst'!K13)","v":0},null,null,null,null,null,24]
[null,"Wohnort:",{"$f":"'3 Auszahlung-Zusammenst'!D13","v":""},null,"Honorar:",{"$f":"SUM('3 Auszahlung-Zusammenst'!M13)","v":0},null,null,null,null,24,25]
[null,null,null,null,"Sonstige Auslagen:",{"$f":"SUM('3 Auszahlung-Zusammenst'!O13)","v":0},null,null,null,null,24,26]
[null,null,null,null,"Summe:",{"$f":"SUM('3 Auszahlung-Zusammenst'!Q13)","v":0},null,null,null,null,24,27]
[null,null,null,null,null,null,null,null,null,null,40,32,-8]
[null,"Mit der Unterschrift auf dem Sammel-Empfangsblatt wird versichert, dass die steuerrechtlichen Vorschriften nach dem EStG beachtet werden.",null,null,{"$f":"IF('1 Deckblatt St.2024-04-09'!$J$57=\"\",\"\",'1 Deckblatt St.2024-04-09'!$J$57)","v":""},null,null,null,null,null,32,32]
[null,null,null,null,null,null,null,null,null,null,null,8]
[null,null,null,null,"(Datum)",null,"(Unterschrift TTBW)",null,null,null,null,14]
[null,null,null,null,null,null,null,null,null,null,null,14]
[null,null,null,null,null,null,null,null,null,null,80,76,-4]
[null,null,null,null,null,null,null,null,null,null,95,91,-4]
[null,"Tischtennis Baden-Württemberg e.V.",null,null,null,null,null,null,null,null,null,10]
[null,null,null,null,null,null,null,{"$f":"IF(Kostenstelle=\"\",\"\",Kostenstelle)","v":""},null,null,null,30]
[null,"Auszahlungs-Bescheinigung",null,null,null,null,null,"Kostenstelle",null,null,null,30]
[null,null,null,null,null,null,null,null,null,null,null,10]
[null,"Veranstaltung:",{"$f":"IF(Veranstaltung=\"\",\"\",Veranstaltung)","v":""},null,null,null,null,null,null,null,null,24]
[null,"Ort:",{"$f":"IF(Ort=\"\",\"\",Ort)","v":""},null,"Datum:",{"$f":"IF(Datum=\"\",\"\",Datum)","v":""},null,null,null,null,null,32]
[null,null,null,null,null,null,null,null,null,null,null,30]
[null,"Empfänger:",null,null,"Fahrkosten:",{"$f":"SUM('3 Auszahlung-Zusammenst'!G14,'3 Auszahlung-Zusammenst'!I14)","v":0},null,null,null,null,null,24]
[null,"Name, Vorname:",{"$f":"'3 Auszahlung-Zusammenst'!C14","v":"LSV"},null,"Tagegeld:",{"$f":"SUM('3 Auszahlung-Zusammenst'!K14)","v":0},null,null,null,null,null,24]
[null,"Wohnort:",{"$f":"'3 Auszahlung-Zusammenst'!D14","v":""},null,"Honorar:",{"$f":"SUM('3 Auszahlung-Zusammenst'!M14)","v":0},null,null,null,null,24,24]
[null,null,null,null,"Sonstige Auslagen:",{"$f":"SUM('3 Auszahlung-Zusammenst'!O14)","v":0},null,null,null,null,24,24]
[null,null,null,null,"Summe:",{"$f":"SUM('3 Auszahlung-Zusammenst'!Q14)","v":0},null,null,null,null,24,24]
[null,null,null,null,null,null,null,null,null,null,40,32,-8]
[null,"Mit der Unterschrift auf dem Sammel-Empfangsblatt wird versichert, dass die steuerrechtlichen Vorschriften nach dem EStG beachtet werden.",null,null,{"$f":"IF('1 Deckblatt St.2024-04-09'!$J$57=\"\",\"\",'1 Deckblatt St.2024-04-09'!$J$57)","v":""},null,null,null,null,null,32,32]
[null,null,null,null,null,null,null,null,null,null,null,8]
[null,null,null,null,"(Datum)",null,"(Unterschrift TTBW)",null,null,null,null,14]
[null,null,null,null,null,null,null,null,null,null,null,14]
[null,null,null,null,null,null,null,null,null,null,24,20,-4]
[null,null,null,null,null,null,null,null,null,null,45,41,-4]
[null,"Tischtennis Baden-Württemberg e.V.",null,null,null,null,null,null,null,null,null,10]
[null,null,null,null,null,null,null,{"$f":"IF(Kostenstelle=\"\",\"\",Kostenstelle)","v":""},null,null,null,30]
[null,"Auszahlungs-Bescheinigung",null,null,null,null,null,"Kostenstelle",null,null,null,30]
[null,null,null,null,null,null,null,null,null,null,null,10]
[null,"Veranstaltung:",{"$f":"IF(Veranstaltung=\"\",\"\",Veranstaltung)","v":""},null,null,null,null,null,null,null,null,24]
[null,"Ort:",{"$f":"IF(Ort=\"\",\"\",Ort)","v":""},null,"Datum:",{"$f":"IF(Datum=\"\",\"\",Datum)","v":""},null,null,null,null,null,32]
[null,null,null,null,null,null,null,null,null,null,null,30]
[null,"Empfänger:",null,null,"Fahrkosten:",{"$f":"SUM('3 Auszahlung-Zusammenst'!G15,'3 Auszahlung-Zusammenst'!I15)","v":0},null,null,null,null,null,24]
[null,"Name, Vorname:",{"$f":"'3 Auszahlung-Zusammenst'!C15","v":"LSV"},null,"Tagegeld:",{"$f":"SUM('3 Auszahlung-Zusammenst'!K15)","v":0},null,null,null,null,null,24]
[null,"Wohnort:",{"$f":"'3 Auszahlung-Zusammenst'!D15","v":""},null,"Honorar:",{"$f":"SUM('3 Auszahlung-Zusammenst'!M15)","v":0},null,null,null,null,24,24]
[null,null,null,null,"Sonstige Auslagen:",{"$f":"SUM('3 Auszahlung-Zusammenst'!O15)","v":0},null,null,null,null,24,24]
[null,null,null,null,"Summe:",{"$f":"SUM('3 Auszahlung-Zusammenst'!Q15)","v":0},null,null,null,null,24,24]
[null,null,null,null,null,null,null,null,null,null,40,32,-8]
[null,"Mit der Unterschrift auf dem Sammel-Empfangsblatt wird versichert, dass die steuerrechtlichen Vorschriften nach dem EStG beachtet werden.",null,null,{"$f":"IF('1 Deckblatt St.2024-04-09'!$J$57=\"\",\"\",'1 Deckblatt St.2024-04-09'!$J$57)","v":""},null,null,null,null,null,32,32]
[null,null,null,null,null,null,null,null,null,null,null,8]
[null,null,null,null,"(Datum)",null,"(Unterschrift TTBW)",null,null,null,null,14]
[null,null,null,null,null,null,null,null,null,null,null,14]
[null,null,null,null,null,null,null,null,null,null,80,76,-4]
[null,null,null,null,null,null,null,null,null,null,95,91,-4]
[null,"Tischtennis Baden-Württemberg e.V.",null,null,null,null,null,null,null,null,null,10]
[null,null,null,null,null,null,null,{"$f":"IF(Kostenstelle=\"\",\"\",Kostenstelle)","v":""},null,null,null,30]
[null,"Auszahlungs-Bescheinigung",null,null,null,null,null,"Kostenstelle",null,null,null,30]
[null,null,null,null,null,null,null,null,null,null,null,10]
[null,"Veranstaltung:",{"$f":"IF(Veranstaltung=\"\",\"\",Veranstaltung)","v":""},null,null,null,null,null,null,null,null,24]
[null,"Ort:",{"$f":"IF(Ort=\"\",\"\",Ort)","v":""},null,"Datum:",{"$f":"IF(Datum=\"\",\"\",Datum)","v":""},null,null,null,null,null,32]
[null,null,null,null,null,null,null,null,null,null,null,30]
[null,"Empfänger:",null,null,"Fahrkosten:",{"$f":"SUM('3 Auszahlung-Zusammenst'!G16,'3 Auszahlung-Zusammenst'!I16)","v":0},null,null,null,null,null,24]
[null,"Name, Vorname:",{"$f":"'3 Auszahlung-Zusammenst'!C16","v":"LSV"},null,"Tagegeld:",{"$f":"SUM('3 Auszahlung-Zusammenst'!K16)","v":0},null,null,null,null,null,24]
[null,"Wohnort:",{"$f":"'3 Auszahlung-Zusammenst'!D16","v":""},null,"Honorar:",{"$f":"SUM('3 Auszahlung-Zusammenst'!M16)","v":0},null,null,null,null,24,24]
[null,null,null,null,"Sonstige Auslagen:",{"$f":"SUM('3 Auszahlung-Zusammenst'!O16)","v":0},null,null,null,null,24,24]
[null,null,null,null,"Summe:",{"$f":"SUM('3 Auszahlung-Zusammenst'!Q16)","v":0},null,null,null,null,24,24]
[null,null,null,null,null,null,null,null,null,null,40,32,-8]
[null,"Mit der Unterschrift auf dem Sammel-Empfangsblatt wird versichert, dass die steuerrechtlichen Vorschriften nach dem EStG beachtet werden.",null,null,{"$f":"IF('1 Deckblatt St.2024-04-09'!$J$57=\"\",\"\",'1 Deckblatt St.2024-04-09'!$J$57)","v":""},null,null,null,null,null,32,32]
[null,null,null,null,null,null,null,null,null,null,null,8]
[null,null,null,null,"(Datum)",null,"(Unterschrift TTBW)",null,null,null,null,14]
[null,null,null,null,null,null,null,null,null,null,null,14]
[null,null,null,null,null,null,null,null,null,null,24,20,-4]
[null,null,null,null,null,null,null,null,null,null,45,41,-4]
[null,"Tischtennis Baden-Württemberg e.V.",null,null,null,null,null,null,null,null,null,10]
[null,null,null,null,null,null,null,{"$f":"IF(Kostenstelle=\"\",\"\",Kostenstelle)","v":""},null,null,null,30]
[null,"Auszahlungs-Bescheinigung",null,null,null,null,null,"Kostenstelle",null,null,null,30]
[null,null,null,null,null,null,null,null,null,null,null,10]
[null,"Veranstaltung:",{"$f":"IF(Veranstaltung=\"\",\"\",Veranstaltung)","v":""},null,null,null,null,null,null,null,null,24]
[null,"Ort:",{"$f":"IF(Ort=\"\",\"\",Ort)","v":""},null,"Datum:",{"$f":"IF(Datum=\"\",\"\",Datum)","v":""},null,null,null,null,null,32]
[null,null,null,null,null,null,null,null,null,null,null,30]
[null,"Empfänger:",null,null,"Fahrkosten:",{"$f":"SUM('3 Auszahlung-Zusammenst'!G17,'3 Auszahlung-Zusammenst'!I17)","v":0},null,null,null,null,null,24]
[null,"Name, Vorname:",{"$f":"'3 Auszahlung-Zusammenst'!C17","v":"TTBW"},null,"Tagegeld:",{"$f":"SUM('3 Auszahlung-Zusammenst'!K17)","v":0},null,null,null,null,null,24]
[null,"Wohnort:",{"$f":"'3 Auszahlung-Zusammenst'!D17","v":""},null,"Honorar:",{"$f":"SUM('3 Auszahlung-Zusammenst'!M17)","v":0},null,null,null,null,24,24]
[null,null,null,null,"Sonstige Auslagen:",{"$f":"SUM('3 Auszahlung-Zusammenst'!O17)","v":0},null,null,null,null,24,24]
[null,null,null,null,"Summe:",{"$f":"SUM('3 Auszahlung-Zusammenst'!Q17)","v":0},null,null,null,null,24,24]
[null,null,null,null,null,null,null,null,null,null,40,32,-8]
[null,"Mit der Unterschrift auf dem Sammel-Empfangsblatt wird versichert, dass die steuerrechtlichen Vorschriften nach dem EStG beachtet werden.",null,null,{"$f":"IF('1 Deckblatt St.2024-04-09'!$J$57=\"\",\"\",'1 Deckblatt St.2024-04-09'!$J$57)","v":""},null,null,null,null,null,32,32]
[null,null,null,null,null,null,null,null,null,null,null,8]
[null,null,null,null,"(Datum)",null,"(Unterschrift TTBW)",null,null,null,null,14]
[null,null,null,null,null,null,null,null,null,null,null,14]
[null,null,null,null,null,null,null,null,null,null,80,76,-4]
[null,null,null,null,null,null,null,null,null,null,95,91,-4]
[null,"Tischtennis Baden-Württemberg e.V.",null,null,null,null,null,null,null,null,null,10]
[null,null,null,null,null,null,null,{"$f":"IF(Kostenstelle=\"\",\"\",Kostenstelle)","v":""},null,null,null,30]
[null,"Auszahlungs-Bescheinigung",null,null,null,null,null,"Kostenstelle",null,null,null,30]
[null,null,null,null,null,null,null,null,null,null,null,10]
[null,"Veranstaltung:",{"$f":"IF(Veranstaltung=\"\",\"\",Veranstaltung)","v":""},null,null,null,null,null,null,null,null,24]
[null,"Ort:",{"$f":"IF(Ort=\"\",\"\",Ort)","v":""},null,"Datum:",{"$f":"IF(Datum=\"\",\"\",Datum)","v":""},null,null,null,null,null,32]
[null,null,null,null,null,null,null,null,null,null,null,30]
[null,"Empfänger:",null,null,"Fahrkosten:",{"$f":"SUM('3 Auszahlung-Zusammenst'!G18,'3 Auszahlung-Zusammenst'!I18)","v":0},null,null,null,null,null,24]
[null,"Name, Vorname:",{"$f":"'3 Auszahlung-Zusammenst'!C18","v":"TTBW"},null,"Tagegeld:",{"$f":"SUM('3 Auszahlung-Zusammenst'!K18)","v":0},null,null,null,null,null,24]
[null,"Wohnort:",{"$f":"'3 Auszahlung-Zusammenst'!D18","v":""},null,"Honorar:",{"$f":"SUM('3 Auszahlung-Zusammenst'!M18)","v":0},null,null,null,null,24,24]
[null,null,null,null,"Sonstige Auslagen:",{"$f":"SUM('3 Auszahlung-Zusammenst'!O18)","v":0},null,null,null,null,24,24]
[null,null,null,null,"Summe:",{"$f":"SUM('3 Auszahlung-Zusammenst'!Q18)","v":0},null,null,null,null,24,24]
[null,null,null,null,null,null,null,null,null,null,40,32,-8]
[null,"Mit der Unterschrift auf dem Sammel-Empfangsblatt wird versichert, dass die steuerrechtlichen Vorschriften nach dem EStG beachtet werden.",null,null,{"$f":"IF('1 Deckblatt St.2024-04-09'!$J$57=\"\",\"\",'1 Deckblatt St.2024-04-09'!$J$57)","v":""},null,null,null,null,null,32,32]
[null,null,null,null,null,null,null,null,null,null,null,8]
[null,null,null,null,"(Datum)",null,"(Unterschrift TTBW)",null,null,null,null,14]
[null,null,null,null,null,null,null,null,null,null,null,14]
[null,null,null,null,null,null,null,null,null,null,24,20,-4]
[null,null,null,null,null,null,null,null,null,null,45,41,-4]
[null,"Tischtennis Baden-Württemberg e.V.",null,null,null,null,null,null,null,null,null,10]
[null,null,null,null,null,null,null,{"$f":"IF(Kostenstelle=\"\",\"\",Kostenstelle)","v":""},null,null,null,30]
[null,"Auszahlungs-Bescheinigung",null,null,null,null,null,"Kostenstelle",null,null,null,30]
[null,null,null,null,null,null,null,null,null,null,null,10]
[null,"Veranstaltung:",{"$f":"IF(Veranstaltung=\"\",\"\",Veranstaltung)","v":""},null,null,null,null,null,null,null,null,24]
[null,"Ort:",{"$f":"IF(Ort=\"\",\"\",Ort)","v":""},null,"Datum:",{"$f":"IF(Datum=\"\",\"\",Datum)","v":""},null,null,null,null,null,32]
[null,null,null,null,null,null,null,null,null,null,null,30]
[null,"Empfänger:",null,null,"Fahrkosten:",{"$f":"SUM('3 Auszahlung-Zusammenst'!G19,'3 Auszahlung-Zusammenst'!I19)","v":0},null,null,null,null,null,24]
[null,"Name, Vorname:",{"$f":"'3 Auszahlung-Zusammenst'!C19","v":"TTBW"},null,"Tagegeld:",{"$f":"SUM('3 Auszahlung-Zusammenst'!K19)","v":0},null,null,null,null,null,24]
[null,"Wohnort:",{"$f":"'3 Auszahlung-Zusammenst'!D19","v":""},null,"Honorar:",{"$f":"SUM('3 Auszahlung-Zusammenst'!M19)","v":0},null,null,null,null,24,24]
[null,null,null,null,"Sonstige Auslagen:",{"$f":"SUM('3 Auszahlung-Zusammenst'!O19)","v":0},null,null,null,null,24,24]
[null,null,null,null,"Summe:",{"$f":"SUM('3 Auszahlung-Zusammenst'!Q19)","v":0},null,null,null,null,24,24]
[null,null,null,null,null,null,null,null,null,null,40,32,-8]
[null,"Mit der Unterschrift auf dem Sammel-Empfangsblatt wird versichert, dass die steuerrechtlichen Vorschriften nach dem EStG beachtet werden.",null,null,{"$f":"IF('1 Deckblatt St.2024-04-09'!$J$57=\"\",\"\",'1 Deckblatt St.2024-04-09'!$J$57)","v":""},null,null,null,null,null,32,32]
[null,null,null,null,null,null,null,null,null,null,null,8]
[null,null,null,null,"(Datum)",null,"(Unterschrift TTBW)",null,null,null,null,14]
[null,null,null,null,null,null,null,null,null,null,null,14]
[null,null,null,null,null,null,null,null,null,null,80,76,-4]
[null,null,null,null,null,null,null,null,null,null,95,91,-4]
[null,"Tischtennis Baden-Württemberg e.V.",null,null,null,null,null,null,null,null,null,10]
[null,null,null,null,null,null,null,{"$f":"IF(Kostenstelle=\"\",\"\",Kostenstelle)","v":""},null,null,null,30]
[null,"Auszahlungs-Bescheinigung",null,null,null,null,null,"Kostenstelle",null,null,null,30]
[null,null,null,null,null,null,null,null,null,null,null,10]
[null,"Veranstaltung:",{"$f":"IF(Veranstaltung=\"\",\"\",Veranstaltung)","v":""},null,null,null,null,null,null,null,null,24]
[null,"Ort:",{"$f":"IF(Ort=\"\",\"\",Ort)","v":""},null,"Datum:",{"$f":"IF(Datum=\"\",\"\",Datum)","v":""},null,null,null,null,null,32]
[null,null,null,null,null,null,null,null,null,null,null,30]
[null,"Empfänger:",null,null,"Fahrkosten:",{"$f":"SUM('3 Auszahlung-Zusammenst'!G20,'3 Auszahlung-Zusammenst'!I20)","v":0},null,null,null,null,null,24]
[null,"Name, Vorname:",{"$f":"'3 Auszahlung-Zusammenst'!C20","v":"TTBW"},null,"Tagegeld:",{"$f":"SUM('3 Auszahlung-Zusammenst'!K20)","v":0},null,null,null,null,null,24]
[null,"Wohnort:",{"$f":"'3 Auszahlung-Zusammenst'!D20","v":""},null,"Honorar:",{"$f":"SUM('3 Auszahlung-Zusammenst'!M20)","v":0},null,null,null,null,24,24]
[null,null,null,null,"Sonstige Auslagen:",{"$f":"SUM('3 Auszahlung-Zusammenst'!O20)","v":0},null,null,null,null,24,24]
[null,null,null,null,"Summe:",{"$f":"SUM('3 Auszahlung-Zusammenst'!Q20)","v":0},null,null,null,null,24,24]
[null,null,null,null,null,null,null,null,null,null,40,32,-8]
[null,"Mit der Unterschrift auf dem Sammel-Empfangsblatt wird versichert, dass die steuerrechtlichen Vorschriften nach dem EStG beachtet werden.",null,null,{"$f":"IF('1 Deckblatt St.2024-04-09'!$J$57=\"\",\"\",'1 Deckblatt St.2024-04-09'!$J$57)","v":""},null,null,null,null,null,32,32]
[null,null,null,null,null,null,null,null,null,null,null,8]
[null,null,null,null,"(Datum)",null,"(Unterschrift TTBW)",null,null,null,null,14]
[null,null,null,null,null,null,null,null,null,null,null,14]
[null,null,null,null,null,null,null,null,null,null,24,20,-4]
[null,null,null,null,null,null,null,null,null,null,45,41,-4]
[null,"Tischtennis Baden-Württemberg e.V.",null,null,null,null,null,null,null,null,null,10]
[null,null,null,null,null,null,null,{"$f":"IF(Kostenstelle=\"\",\"\",Kostenstelle)","v":""},null,null,null,30]
[null,"Auszahlungs-Bescheinigung",null,null,null,null,null,"Kostenstelle",null,null,null,30]
[null,null,null,null,null,null,null,null,null,null,null,10]
[null,"Veranstaltung:",{"$f":"IF(Veranstaltung=\"\",\"\",Veranstaltung)","v":""},null,null,null,null,null,null,null,null,24]
[null,"Ort:",{"$f":"IF(Ort=\"\",\"\",Ort)","v":""},null,"Datum:",{"$f":"IF(Datum=\"\",\"\",Datum)","v":""},null,null,null,null,null,32]
[null,null,null,null,null,null,null,null,null,null,null,30]
[null,"Empfänger:",null,null,"Fahrkosten:",{"$f":"SUM('3 Auszahlung-Zusammenst'!G21,'3 Auszahlung-Zusammenst'!I21)","v":0},null,null,null,null,null,24]
[null,"Name, Vorname:",{"$f":"'3 Auszahlung-Zusammenst'!C21","v":"TTBW"},null,"Tagegeld:",{"$f":"SUM('3 Auszahlung-Zusammenst'!K21)","v":0},null,null,null,null,null,24]
[null,"Wohnort:",{"$f":"'3 Auszahlung-Zusammenst'!D21","v":""},null,"Honorar:",{"$f":"SUM('3 Auszahlung-Zusammenst'!M21)","v":0},null,null,null,null,24,24]
[null,null,null,null,"Sonstige Auslagen:",{"$f":"SUM('3 Auszahlung-Zusammenst'!O21)","v":0},null,null,null,null,24,24]
[null,null,null,null,"Summe:",{"$f":"SUM('3 Auszahlung-Zusammenst'!Q21)","v":0},null,null,null,null,24,24]
[null,null,null,null,null,null,null,null,null,null,40,32,-8]
[null,"Mit der Unterschrift auf dem Sammel-Empfangsblatt wird versichert, dass die steuerrechtlichen Vorschriften nach dem EStG beachtet werden.",null,null,{"$f":"IF('1 Deckblatt St.2024-04-09'!$J$57=\"\",\"\",'1 Deckblatt St.2024-04-09'!$J$57)","v":""},null,null,null,null,null,32,32]
[null,null,null,null,null,null,null,null,null,null,null,8]
[null,null,null,null,"(Datum)",null,"(Unterschrift TTBW)",null,null,null,null,14]
[null,null,null,null,null,null,null,null,null,null,null,14]
[null,null,null,null,null,null,null,null,null,null,80,76,-4]
[null,null,null,null,null,null,null,null,null,null,95,91,-4]
[null,"Tischtennis Baden-Württemberg e.V.",null,null,null,null,null,null,null,null,null,10]
[null,null,null,null,null,null,null,{"$f":"IF(Kostenstelle=\"\",\"\",Kostenstelle)","v":""},null,null,null,30]
[null,"Auszahlungs-Bescheinigung",null,null,null,null,null,"Kostenstelle",null,null,null,30]
[null,null,null,null,null,null,null,null,null,null,null,10]
[null,"Veranstaltung:",{"$f":"IF(Veranstaltung=\"\",\"\",Veranstaltung)","v":""},null,null,null,null,null,null,null,null,24]
[null,"Ort:",{"$f":"IF(Ort=\"\",\"\",Ort)","v":""},null,"Datum:",{"$f":"IF(Datum=\"\",\"\",Datum)","v":""},null,null,null,null,null,32]
[null,null,null,null,null,null,null,null,null,null,null,30]
[null,"Empfänger:",null,null,"Fahrkosten:",{"$f":"SUM('3 Auszahlung-Zusammenst'!G22,'3 Auszahlung-Zusammenst'!I22)","v":0},null,null,null,null,null,24]
[null,"Name, Vorname:",{"$f":"'3 Auszahlung-Zusammenst'!C22","v":"TTBW"},null,"Tagegeld:",{"$f":"SUM('3 Auszahlung-Zusammenst'!K22)","v":0},null,null,null,null,null,24]
[null,"Wohnort:",{"$f":"'3 Auszahlung-Zusammenst'!D22","v":""},null,"Honorar:",{"$f":"SUM('3 Auszahlung-Zusammenst'!M22)","v":0},null,null,null,null,24,24]
[null,null,null,null,"Sonstige Auslagen:",{"$f":"SUM('3 Auszahlung-Zusammenst'!O22)","v":0},null,null,null,null,24,24]
[null,null,null,null,"Summe:",{"$f":"SUM('3 Auszahlung-Zusammenst'!Q22)","v":0},null,null,null,null,24,24]
[null,null,null,null,null,null,null,null,null,null,40,32,-8]
[null,"Mit der Unterschrift auf dem Sammel-Empfangsblatt wird versichert, dass die steuerrechtlichen Vorschriften nach dem EStG beachtet werden.",null,null,{"$f":"IF('1 Deckblatt St.2024-04-09'!$J$57=\"\",\"\",'1 Deckblatt St.2024-04-09'!$J$57)","v":""},null,null,null,null,null,32,32]
[null,null,null,null,null,null,null,null,null,null,null,8]
[null,null,null,null,"(Datum)",null,"(Unterschrift TTBW)",null,null,null,null,14]
[null,null,null,null,null,null,null,null,null,null,null,14]
[null,null,null,null,null,null,null,null,null,null,24,20,-4]
[null,null,null,null,null,null,null,null,null,null,45,41,-4]
[null,"Tischtennis Baden-Württemberg e.V.",null,null,null,null,null,null,null,null,null,10]
[null,null,null,null,null,null,null,{"$f":"IF(Kostenstelle=\"\",\"\",Kostenstelle)","v":""},null,null,null,30]
[null,"Auszahlungs-Bescheinigung",null,null,null,null,null,"Kostenstelle",null,null,null,30]
[null,null,null,null,null,null,null,null,null,null,null,10]
[null,"Veranstaltung:",{"$f":"IF(Veranstaltung=\"\",\"\",Veranstaltung)","v":""},null,null,null,null,null,null,null,null,24]
[null,"Ort:",{"$f":"IF(Ort=\"\",\"\",Ort)","v":""},null,"Datum:",{"$f":"IF(Datum=\"\",\"\",Datum)","v":""},null,null,null,null,null,32]
[null,null,null,null,null,null,null,null,null,null,null,30]
[null,"Empfänger:",null,null,"Fahrkosten:",{"$f":"SUM('3 Auszahlung-Zusammenst'!G23,'3 Auszahlung-Zusammenst'!I23)","v":0},null,null,null,null,null,24]
[null,"Name, Vorname:",{"$f":"'3 Auszahlung-Zusammenst'!C23","v":"TTBW"},null,"Tagegeld:",{"$f":"SUM('3 Auszahlung-Zusammenst'!K23)","v":0},null,null,null,null,null,24]
[null,"Wohnort:",{"$f":"'3 Auszahlung-Zusammenst'!D23","v":""},null,"Honorar:",{"$f":"SUM('3 Auszahlung-Zusammenst'!M23)","v":0},null,null,null,null,24,24]
[null,null,null,null,"Sonstige Auslagen:",{"$f":"SUM('3 Auszahlung-Zusammenst'!O23)","v":0},null,null,null,null,24,24]
[null,null,null,null,"Summe:",{"$f":"SUM('3 Auszahlung-Zusammenst'!Q23)","v":0},null,null,null,null,24,24]
[null,null,null,null,null,null,null,null,null,null,40,32,-8]
[null,"Mit der Unterschrift auf dem Sammel-Empfangsblatt wird versichert, dass die steuerrechtlichen Vorschriften nach dem EStG beachtet werden.",null,null,{"$f":"IF('1 Deckblatt St.2024-04-09'!$J$57=\"\",\"\",'1 Deckblatt St.2024-04-09'!$J$57)","v":""},null,null,null,null,null,32,32]
[null,null,null,null,null,null,null,null,null,null,null,8]
[null,null,null,null,"(Datum)",null,"(Unterschrift TTBW)",null,null,null,null,14]
[null,null,null,null,null,null,null,null,null,null,null,14]
[null,null,null,null,null,null,null,null,null,null,80,76,-4]
[null,null,null,null,null,null,null,null,null,null,95,91,-4]
[null,"Tischtennis Baden-Württemberg e.V.",null,null,null,null,null,null,null,null,null,10]
[null,null,null,null,null,null,null,{"$f":"IF(Kostenstelle=\"\",\"\",Kostenstelle)","v":""},null,null,null,30]
[null,"Auszahlungs-Bescheinigung",null,null,null,null,null,"Kostenstelle",null,null,null,30]
[null,null,null,null,null,null,null,null,null,null,null,10]
[null,"Veranstaltung:",{"$f":"IF(Veranstaltung=\"\",\"\",Veranstaltung)","v":""},null,null,null,null,null,null,null,null,24]
[null,"Ort:",{"$f":"IF(Ort=\"\",\"\",Ort)","v":""},null,"Datum:",{"$f":"IF(Datum=\"\",\"\",Datum)","v":""},null,null,null,null,null,32]
[null,null,null,null,null,null,null,null,null,null,null,30]
[null,"Empfänger:",null,null,"Fahrkosten:",{"$f":"SUM('3 Auszahlung-Zusammenst'!G24,'3 Auszahlung-Zusammenst'!I24)","v":0},null,null,null,null,null,24]
[null,"Name, Vorname:",{"$f":"'3 Auszahlung-Zusammenst'!C24","v":"TTBW"},null,"Tagegeld:",{"$f":"SUM('3 Auszahlung-Zusammenst'!K24)","v":0},null,null,null,null,null,24]
[null,"Wohnort:",{"$f":"'3 Auszahlung-Zusammenst'!D24","v":""},null,"Honorar:",{"$f":"SUM('3 Auszahlung-Zusammenst'!M24)","v":0},null,null,null,null,24,24]
[null,null,null,null,"Sonstige Auslagen:",{"$f":"SUM('3 Auszahlung-Zusammenst'!O24)","v":0},null,null,null,null,24,24]
[null,null,null,null,"Summe:",{"$f":"SUM('3 Auszahlung-Zusammenst'!Q24)","v":0},null,null,null,null,24,24]
[null,null,null,null,null,null,null,null,null,null,40,32,-8]
[null,"Mit der Unterschrift auf dem Sammel-Empfangsblatt wird versichert, dass die steuerrechtlichen Vorschriften nach dem EStG beachtet werden.",null,null,{"$f":"IF('1 Deckblatt St.2024-04-09'!$J$57=\"\",\"\",'1 Deckblatt St.2024-04-09'!$J$57)","v":""},null,null,null,null,null,32,32]
[null,null,null,null,null,null,null,null,null,null,null,8]
[null,null,null,null,"(Datum)",null,"(Unterschrift TTBW)",null,null,null,null,14]
[null,null,null,null,null,null,null,null,null,null,null,14]
[null,null,null,null,null,null,null,null,null,null,24,20,-4]
[null,null,null,null,null,null,null,null,null,null,45,41,-4]
[null,"Tischtennis Baden-Württemberg e.V.",null,null,null,null,null,null,null,null,null,10]
[null,null,null,null,null,null,null,{"$f":"IF(Kostenstelle=\"\",\"\",Kostenstelle)","v":""},null,null,null,30]
[null,"Auszahlungs-Bescheinigung",null,null,null,null,null,"Kostenstelle",null,null,null,30]
[null,null,null,null,null,null,null,null,null,null,null,10]
[null,"Veranstaltung:",{"$f":"IF(Veranstaltung=\"\",\"\",Veranstaltung)","v":""},null,null,null,null,null,null,null,null,24]
[null,"Ort:",{"$f":"IF(Ort=\"\",\"\",Ort)","v":""},null,"Datum:",{"$f":"IF(Datum=\"\",\"\",Datum)","v":""},null,null,null,null,null,32]
[null,null,null,null,null,null,null,null,null,null,null,30]
[null,"Empfänger:",null,null,"Fahrkosten:",{"$f":"SUM('3 Auszahlung-Zusammenst'!G25,'3 Auszahlung-Zusammenst'!I25)","v":0},null,null,null,null,null,24]
[null,"Name, Vorname:",{"$f":"'3 Auszahlung-Zusammenst'!C25","v":"TTBW"},null,"Tagegeld:",{"$f":"SUM('3 Auszahlung-Zusammenst'!K25)","v":0},null,null,null,null,null,24]
[null,"Wohnort:",{"$f":"'3 Auszahlung-Zusammenst'!D25","v":""},null,"Honorar:",{"$f":"SUM('3 Auszahlung-Zusammenst'!M25)","v":0},null,null,null,null,24,24]
[null,null,null,null,"Sonstige Auslagen:",{"$f":"SUM('3 Auszahlung-Zusammenst'!O25)","v":0},null,null,null,null,24,24]
[null,null,null,null,"Summe:",{"$f":"SUM('3 Auszahlung-Zusammenst'!Q25)","v":0},null,null,null,null,24,24]
[null,null,null,null,null,null,null,null,null,null,40,32,-8]
[null,"Mit der Unterschrift auf dem Sammel-Empfangsblatt wird versichert, dass die steuerrechtlichen Vorschriften nach dem EStG beachtet werden.",null,null,{"$f":"IF('1 Deckblatt St.2024-04-09'!$J$57=\"\",\"\",'1 Deckblatt St.2024-04-09'!$J$57)","v":""},null,null,null,null,null,32,32]
[null,null,null,null,null,null,null,null,null,null,null,8]
[null,null,null,null,"(Datum)",null,"(Unterschrift TTBW)",null,null,null,null,14]
[null,null,null,null,null,null,null,null,null,null,null,14]
[null,null,null,null,null,null,null,null,null,null,80,76,-4]
[null,null,null,null,null,null,null,null,null,null,95,91,-4]
[null,"Tischtennis Baden-Württemberg e.V.",null,null,null,null,null,null,null,null,null,10]
[null,null,null,null,null,null,null,{"$f":"IF(Kostenstelle=\"\",\"\",Kostenstelle)","v":""},null,null,null,30]
[null,"Auszahlungs-Bescheinigung",null,null,null,null,null,"Kostenstelle",null,null,null,30]
[null,null,null,null,null,null,null,null,null,null,null,10]
[null,"Veranstaltung:",{"$f":"IF(Veranstaltung=\"\",\"\",Veranstaltung)","v":""},null,null,null,null,null,null,null,null,24]
[null,"Ort:",{"$f":"IF(Ort=\"\",\"\",Ort)","v":""},null,"Datum:",{"$f":"IF(Datum=\"\",\"\",Datum)","v":""},null,null,null,null,null,32]
[null,null,null,null,null,null,null,null,null,null,null,30]
[null,"Empfänger:",null,null,"Fahrkosten:",{"$f":"SUM('3 Auszahlung-Zusammenst'!G26,'3 Auszahlung-Zusammenst'!I26)","v":0},null,null,null,null,null,24]
[null,"Name, Vorname:",{"$f":"'3 Auszahlung-Zusammenst'!C26","v":"TTBW"},null,"Tagegeld:",{"$f":"SUM('3 Auszahlung-Zusammenst'!K26)","v":0},null,null,null,null,null,24]
[null,"Wohnort:",{"$f":"'3 Auszahlung-Zusammenst'!D26","v":""},null,"Honorar:",{"$f":"SUM('3 Auszahlung-Zusammenst'!M26)","v":0},null,null,null,null,24,24]
[null,null,null,null,"Sonstige Auslagen:",{"$f":"SUM('3 Auszahlung-Zusammenst'!O26)","v":0},null,null,null,null,24,24]
[null,null,null,null,"Summe:",{"$f":"SUM('3 Auszahlung-Zusammenst'!Q26)","v":0},null,null,null,null,24,24]
[null,null,null,null,null,null,null,null,null,null,40,32,-8]
[null,"Mit der Unterschrift auf dem Sammel-Empfangsblatt wird versichert, dass die steuerrechtlichen Vorschriften nach dem EStG beachtet werden.",null,null,{"$f":"IF('1 Deckblatt St.2024-04-09'!$J$57=\"\",\"\",'1 Deckblatt St.2024-04-09'!$J$57)","v":""},null,null,null,null,null,32,32]
[null,null,null,null,null,null,null,null,null,null,null,8]
[null,null,null,null,"(Datum)",null,"(Unterschrift TTBW)",null,null,null,null,14]
[null,null,null,null,null,null,null,null,null,null,null,14]
[null,null,null,null,null,null,null,null,null,null,24,20,-4]
[null,null,null,null,null,null,null,null,null,null,45,41,-4]
[null,null,null,null,null,null,null,null,null,null,null,10]
[null,null,null,null,null,null,null,null,null,null,null,30]
[null,null,null,null,null,null,null,null,null,null,null,30]
[null,null,null,null,null,null,null,null,null,null,null,10]
[null,null,null,null,null,null,null,null,null,null,null,24]
[null,null,null,null,null,null,null,null,null,null,null,32]
[null,null,null,null,null,null,null,null,null,null,null,30]
[null,null,null,null,null,null,null,null,null,null,null,24]
[null,null,null,null,null,null,null,null,null,null,null,24]
[null,null,null,null,null,null,null,null,null,null,24,24]
[null,null,null,null,null,null,null,null,null,null,24,24]
[null,null,null,null,null,null,null,null,null,null,24,24]
[null,null,null,null,null,null,null,null,null,null,40,32,-8]
[null,null,null,null,null,null,null,null,null,null,32,32]
[null,null,null,null,null,null,null,null,null,null,null,8]
[null,null,null,null,null,null,null,null,null,null,null,14]
[null,null,null,null,null,null,null,null,null,null,null,14]
[null,null,null,null,null,null,null,null,null,null,80,76,-4]
[null,null,null,null,null,null,null,null,null,null,95,91,-4]
[null,null,null,null,null,null,null,null,null,null,null,10]
[null,null,null,null,null,null,null,null,null,null,null,30]
[null,null,null,null,null,null,null,null,null,null,null,30]
[null,null,null,null,null,null,null,null,null,null,null,10]
[null,null,null,null,null,null,null,null,null,null,null,24]
[null,null,null,null,null,null,null,null,null,null,null,32]
[null,null,null,null,null,null,null,null,null,null,null,30]
[null,null,null,null,null,null,null,null,null,null,null,24]
[null,null,null,null,null,null,null,null,null,null,null,24]
[null,null,null,null,null,null,null,null,null,null,24,24]
[null,null,null,null,null,null,null,null,null,null,24,24]
[null,null,null,null,null,null,null,null,null,null,24,24]
[null,null,null,null,null,null,null,null,null,null,40,32,-8]
[null,null,null,null,null,null,null,null,null,null,32,32]
[null,null,null,null,null,null,null,null,null,null,null,8]
[null,null,null,null,null,null,null,null,null,null,null,14]
[null,null,null,null,null,null,null,null,null,null,null,14]
[null,null,null,null,null,null,null,null,null,null,24,20,-4]

{"sheet":"11 Anleitung","index":10,"n_rows":128,"n_cols":4,"rows_kept":128,"cut":false,"hidden":false,"merged":[[360,1,360,3],[354,1,354,3],[355,1,355,3],[356,1,356,3],[357,1,357,3],[358,1,358,3],[359,1,359,3],[121,1,121,2],[122,1,122,2],[123,1,123,2],[124,1,124,2],[125,1,125,2],[126,1,126,2],[127,1,127,2],[128,1,128,2],[344,1,344,3],[345,1,345,3],[346,1,346,3],[347,1,347,3],[118,1,118,2],[119,1,119,2],[120,1,120,2],[348,1,348,3],[349,1,349,3],[350,1,350,3],[351,1,351,3],[352,1,352,3],[353,1,353,3],[108,1,108,2],[109,1,109,2],[110,1,110,2],[111,1,111,2],[112,1,112,2],[113,1,113,2],[114,1,114,2],[115,1,115,2],[116,1,116,2],[98,1,98,2],[99,1,99,2],[100,1,100,2],[101,1,101,2],[102,1,102,2],[103,1,103,2],[104,1,104,2],[105,1,105,2],[106,1,106,2],[88,1,88,2],[89,1,89,2],[90,1,90,2],[91,1,91,2],[92,1,92,2],[93,1,93,2],[94,1,94,2],[95,1,95,2],[97,1,97,2],[79,1,79,2],[80,1,80,2],[81,1,81,2],[82,1,82,2],[83,1,83,2],[84,1,84,2],[85,1,85,2],[86,1,86,2],[87,1,87,2],[70,1,70,2],[71,1,71,2],[72,1,72,2],[73,1,73,2],[74,1,74,2],[75,1,75,2],[76,1,76,2],[77,1,77,2],[78,1,78,2],[61,1,61,2],[62,1,62,2],[63,1,63,2],[64,1,64,2],[65,1,65,2],[66,1,66,2],[67,1,67,2],[68,1,68,2],[69,1,69,2],[51,2,51,3],[53,1,53,3],[54,1,54,3],[55,1,55,3],[56,1,56,2],[57,1,57,2],[58,1,58,2],[59,1,59,2],[60,1,60,2],[42,2,42,3],[43,2,43,3],[44,2,44,3],[45,2,45,3],[46,2,46,3],[47,2,47,3],[48,2,48,3],[49,2,49,3],[50,2,50,3],[32,2,32,3],[33,2,33,3],[34,2,34,3],[36,1,36,3],[37,2,37,3],[38,2,38,3],[39,2,39,3],[40,2,40,3],[41,2,41,3],[16,2,16,3],[17,2,17,3],[18,2,18,3],[29,1,29,3],[19,2,19,3],[20,1,20,3],[21,1,21,3],[30,2,30,3],[31,2,31,3],[23,1,23,3],[24,1,24,3],[25,2,25,3],[26,2,26,3],[27,2,27,3],[13,2,13,3],[1,1,1,3],[3,1,3,3],[6,1,6,3],[10,1,10,3],[11,2,11,3],[12,2,12,3],[14,2,14,3],[15,2,15,3]]}
[]
[null,"Tischtennis Baden-Württemberg e.V."]
[]
[null,"Anleitung zum Ausfüllen des Abrechnungs-Formulars Veranstaltungen"]
[null,null,"Datei-Name:","FO_TTBW-07e Abr-Veranst.xls (Version v3.6)"]
[]
[null,"Formulararten"]
[null,"\u0097","Elektronisch  (e)","ist am PC mit dem Windows-Office Programm EXCEL 97/2003 auszufüllen"]
[null,"\u0097","Manuell  (m)","gibt es für dieses Formular nicht: manuell müssten zu viele Eintragungen gemacht werden und der Vorteil mit den automatischen Berechnungen wäre hinfällig"]
[]
[null,"Einleitung: Das Veranstaltungs-Abrechnungsformular ...."]
[null,"\u0097","ersetzt das alte Sammelabrechnungsformular"]
[null,"\u0097","enthält auch die Abrechnungen für Turnierleitung und Schiedsrichter; wenn nur als Team-Abrechnung verwendet (bei auswärtigen Veranstaltungen), werden die betr. Blätter nicht benötigt, müssen aber im Arbeitsmappen-Paket bleiben"]
[null,"\u0097","besteht aus:"]
[null,null,"─   Deckblatt"]
[null,null,"─   2 Blättern Zusammenstellung: eines enthält die Auszahlungen an die Betreuer und Trainer"]
[null,null,"─   4 Berechnungsblätter: mit Eingabefelder für Zeiten, Kilometer und Funktion"]
[null,null,"─   1 Arbeitsblatt mit insgesamt 15 Auszahlungsbescheinigungen für Betreuer und Trainer"]
[null,null,"─   2 Empfangsblätter: für Spieler und Betreuer bzw. Turnierleitung und Schiedsrichter; als Beleg zum unterschreiben"]
[]
[null,"Kennwortschutz"]
[null,"Alle Blätter der EXCEL-Arbeitsmappe sind mit einem Kennwort geschützt, damit der Inhalt, die Formeln und die Formatierung nicht versehentlich verändert werden. Eine Veränderung sollte nur bei vohandenem Know-how oder von damit damit autorisierten Personen vorgenommen werden. Das Kennwort lautet  TTBW."]
[]
[null,"Anwendungs-Tipps"]
[null,"Auch im geschützen Modus sind folgende Tools anwendbar:"]
[null,"\u0097","ein- und ausblenden der Gitternetzlinien:  \"Ansicht\" > \"Anzeigen\""]
[null,"\u0097","ein- und ausblenden von Nullwerten (wenn sie stören):   \"Datei\" > \"Optionen\" > \"Erweitert\" > \"Optionen für dieses Arbeitsblatt anzeigen:\" > Kreuz \"In Zellen mit Nullwert eine Null anzeigen\""]
[null,"\u0097","wenn Cursor mit TAB nicht richtig weiterspringt, mit der Maus das nächste Feld anklicken"]
[]
[null,"Ausfüllfelder"]
[null,"\u0097","Die auszufüllenden Felder sind hellgrau hinterlegt. Die weißen Felder sind gesperrt und enthalten z.T. Formeln und Funktionen."]
[null,"\u0097","Die Felder sind vorformatiert."]
[null,"\u0097","Bei einigen Felder können nur vorgegebene Zeichen oder Begriffe eingegeben werden."]
[null,"\u0097","Die meisten Falscheingaben werden angezeigt."]
[null,"\u0097","Ein paar für die Berechnung nicht relevante Felder sind mit einer Voreingabe hinterlegt und können überschrieben werden. Im Lauf der Updates wird dies durch andere Gestaltung ersetzt."]
[]
[null,"Anwendung und Ablauf"]
[null,"\u0097","Vor der Veranstaltung sind die Blätter mit den erforderlichen Angaben zu füllen."]
[null,"\u0097","Für die Kalkulation der benötigten Mittel und Vorschüsse sind auf Blatt 2 in der oberen Tabelle \"Kosten-Zusammenstellung\" die berechneten Werte aus der Spalte \"Ist-Kosten\" in die Spalte \"Kalkulation\" zu übertragen. Wegen Blattschutz kann dies nicht mit \"Copy & Paste\" erfolgen, sondern muss manuell übertragen werden."]
[null,"\u0097","Wenn man den Blattschutz aufhebt (bitte mit Vorsicht), können die Daten (aber nur \"Werte\") rüberkopiert werden."]
[null,"\u0097","In der kleinen Tabelle \"Abrechnung mit Delegationsleiter\"  kann dann der notwendige Vorschuss berechnet werden. Wenn von diesem Vorschuss die Ausgaben für Mietfahrzeug, Hotel-Kosten oder Startgeld nicht zu zahlen sind, sind die betr. Felder in der entsprechenden Spalte mit einem x zu markieren"]
[null,"\u0097","Der notwendige Vorschuss \"mind. Vorschuss-Betrag\" mit Sicherheits-Zuschlag, ist beim VP Finanzen per E-Mail mit der Vorlage \"Vorschuss Kopier-Vorlage v1.doc\"  zu beantragen."]
[null,"\u0097","In der zweiten kleinen Tabelle ist der Vorschuss zu vermerken und mit der persönlichen Vorschuss-Sachkonto-Nummer zu versehen."]
[null,"\u0097","Für die Veranstaltung sind die Empfangs-Blätter 8 und wenn zutreffend auch 9 auszudrucken und mitzunehmen. Außerdem die Empfangs-Bescheinigungen für die Betreuer und Trainer."]
[null,"\u0097","Hilfreich dürfte es sein, auch die anderen Blätter auszudrucken und mitzunehmen."]
[null,"\u0097","Bei der Veranstaltung sind die angegebenen Daten (km, Zeiten) wenn nötig zu korrigieren und die kalkulierten Euro-Beträge entsprechend abzuändern."]
[null,"\u0097","Die Gesamtbeträge sind auszuzahlen und mit Unterschrift quittieren zu lassen."]
[null,"\u0097","Auf den Empfangsbescheinigungen sind wenn nötig die Beträge zu ändern; sie könnten dann vor Ort ausgegeben werden."]
[null,"\u0097","Nach der Veranstaltung ist die Abrechnung zu vervollständigen - evtl. mit den korrigierten Zahlen."]
[null,"\u0097","Wenn  alles komplett ist, stimmen auch die Auszahlungsbescheinigungen auf Blatt 10. Sollten diese nicht schon bei der Veranstaltung ausgegeben worden sein, kann dies jetzt persönlich bei nächster Gelegenheit oder per Post erfolgen. "]
[null,"\u0097","Entsprechend der Abrechnung auf Blatt 2 ist die Differenz mit der TTBW-Kasse auszugleichen. Das persönliche Vorschuss-Konto wird vom VP-Finanzen be- oder entlastet."]
[null,"\u0097","Die komplette Abrechnung (ohne die Seiten der Auszahlbelege und ohne die evtl. nicht zutreffenden Blätter 7 und 9) ist mit den notwendigen Belegen und Quittungen an die Geschäftsstelle des TTVWH zur Weiter-Bearbeitung zu schicken. "]
[]
[]
[null,"Eingabefelder:"]
[null,"Bei den PC-Formularen kommt man mit TAB von einer Ausfüllzelle zur anderen. Wenn das nicht geht, mit der Maus das nächste hellgraue Feld anklicken."]
[null,"Blatt 1",null,"1 Deckblatt St.2011-xx-xx"]
[null,"Kostenstelle",null,"Wenn nicht schon eingetragen, ist die 8-stellige Nummer von Frank Fürste oder Sönke Geil zu erfragen. Die Nummer wird dann automatisch auf alle Blätter übertragen."]
[null,"Verantw./Delegationsl.",null,"vollständig ausfüllen"]
[null,"Bankverbindung",null,"vollständig ausfüllen"]
[null,"Veranstaltung",null,"Bezeichnung, es kann auch die Angabe aus der Kostenstellen-Liste verwendet werden."]
[null,"Ort / Datum",null,"eintragen; wird auf andere Blätter übertragen"]
[null,"Teilnehmer",null,"erfolgt in 3 Gruppen: Spieler, Betreuer, Sonstige "]
[null,null,null,"Bei \"Sonstige\" kann für Funktion nur aus der Dropdown-Liste ausgewählt werden.  Diese Angabe wird für die weitere Berechnung verwendet."]
[null,"Gesamtkosten",null,"Das Feld wird automatisch ausgefüllt. Wenn Abrechnungsteile bei der Abgabe fehlen, ist dies hier zu vermerken: Kästchen ankreuzen und Angabe machen (z.B. Startgeld oder Bus-Miete)."]
[null,"Datum und Unterschriften",null,"Datum eintippen: in der Form dd.mm (Excel macht daraus komplettes Datum) oder  \"Strg\" + \".\" (heutiges Datum). Das Datum wird im Blatt 10 für die Auszahl-Belege übernommen, kann dort aber gelöschte und überschrieben werden."]
[null,null,null,"Die Unterschrift muss von Hand im Ausdruck erfolgen.\nWenn digitale Signatur erlaubt und allgemein möglich ist, dann diese (Anleitung dazu später)."]
[]
[null,"Blatt 2",null,"2 Zusammenstellung:   (zunächst keine Einträge - siehe weiter unten)"]
[]
[null,"Blatt 3",null,"3 Auszahlung-Zusammenst:   "]
[null,null,null,"keine Einträge - wird vom Buchhalter und dem \"Controller für Finanzen\" benötigt"]
[]
[null,"Blatt 4",null,"4 Honorar+TG, Betreuer"]
[null,null,null,"Für jeden Betreuer, Trainer, Funktionär sind die Reisedaten einzutragen und die Abzüge beim Tagegeld anzukreuzen."]
[null,null,null,"Kreuze sind auch zu setzen, wenn Honorar und/oder Tagegeld erwartet wird. Aus der Trainer-Angabe werden die zutreffenden Sätze ausgewählt und die Beträge berechnet."]
[null,null,null,"Für die ersten 3 Personen sind 4-tägige Reiseangaben möglich, auch für die letzten vier ( Deli, Physio u.a.). Für die anderen 3-tägige Reisen (das müsste ausreichen - später Verbesserung mit dynamischer Tabelle)."]
[null,"Datum",null,"des 1. Tages sowie des letzten Tages muss eingegeben werden. Alle Datums-Formate sind zulässig (mit Punkt), der letzte Punkt ist nicht erforderlich. Wenn kein Jahr jj,  dann wird daraus das aktuelle Jahr, bei Monat der aktuelle Monat."]
[null,"Reisezeit",null,"Hier reicht auch die Zeit der Abreise am 1. Tag und die Ankunftszeit des letzten Tages. In den Zwischenzeiten können andere Zeiten angegeben werden. Wenn da nichts steht, geht es bis 24:00 Uhr bzw ab 00:00. Fehlerhafte Angaben (z.B. negative Dauer) wird angezeigt. Beim Format ist der Doppelpunkt erforderlich, sonst falsche Berechnung:  z.B. 12:  oder 12:00."]
[null,"Honorar",null,"Ein Kreuz (x oder X) ist zu setzen, wenn Honorar zusteht und gewünscht wird. Mit der Trainer-Angabe wird dies überprüft."]
[null,"Tagegeld",null,"Wer kein Tagegeld will oder bekommt, für den wird kein Kreuz gesetzt."]
[null,"TTBW-Trainer",null,"Das sind die nach LSV-Regelungen zu bezahlende Landestrainer."]
[null,"Trainer + Deli",null,"Trainer sind alle anderen Trainer. Hier ist auch der Delegationsleiter anzukreuzen, der dann Honorar bekommt, aber nur 25 c/km. Rechnet sich nur bis 500, 1000 bzw., 1500 km bei 1, 2, 3-Tagen. Wird keines der beiden Kriterien angekreuzt, wird die Person als Funktionär/Ehrenamtlicher behandelt."]
[null,"Frühstück",null,"Wenn Übernachtung mit Frühstück gestellt und bezahlt wird, ist hier ein Abzugs-Kreuz zu setzen."]
[null,"Mittag- / Abendessen",null,"kommt nur vor  bei Vollverpflegung bei Turnieren oder in Sportschulen."]
[null,"Tagegeldsatz",null,"Wird berechnet aus Funktionsangaben und der Reisedauer des betr. Tages. Ob es eine ein- oder mehrtägige Reise ist, wird aus den Reisedaten ermittelt."]
[null,"Abzüge",null,"werden differenziert ermittelt aus Funktionsangabe und den Abzugskreuzen."]
[null,"Tagegeld-Betrag",null,"Hier wird das Ergebnis ausgegeben. Wenn Abzüge höher als Tagegeld-Satz, dann 0,00."]
[null,"Honorar",null,"Maximal pro Veranstaltung sind 75,00 € möglich."]
[]
[null,"Blatt 5",null,"5 Fahrgeld + s.A."]
[null,null,null,"Aus den Funktions-Daten wird mit den angegebenen Fahrstrecken (km) das Kilometergeld berechnet. Dazu kommen Zusatzangaben für öffentl. VkM und Sonstige Reise-Auslagen. Für die Spieler gibt es ab 1.7.2011 keine Fahrkosten."]
[null,"Fahrkosten Pkw",null,"Fahrstrecke hin und zurück in km."]
[null,"öffentl. VkM",null,"Kosten der Fahrkarten. Belege/Quittungen sind beizufügen."]
[null,"Sonstige Auslagen",null,"nur Reisekosten, z.B. Parkgebühren; Auswahl aus der Dropdown-Liste >> Sachkonto wird daraus generiert"]
[null,"Lehrgangsgebühren",null,"und Teilnehmergebühren: Nur bei Spielern. In der Kosten werden sie als Abzüge eingerechnet."]
[]
[]
[null,"Blatt 6",null,"6 Sonstige Kosten"]
[null,null,null,"Hier werden in verschiedenen Tabellen alle anderen Ausgaben aufgelistet."]
[null,"Bewirtung",null,"von Spielern: Abendessen, Turnierverpflegung, Reiseverpflegung, Hallenverpflegung"]
[null,"Mietwagen",null,"Auch der TTVWH-Bus wird hier aufgenommen. Zu jedem Fahrzeug sind 2 Tank-Rechnungen möglich. Sollten es mehr sein, in einer Zeile darunter aufführen."]
[null,"Übernachtung",null,"in Sportschule und Hotels. Bis zu 4 Einträge sind möglich. Unter Beschreibung z.B. Zimmerart angeben  (EZ, DZ, 3BZ, App) und Anzahl der Nächte."]
[null,"Dienstleistung",null,"Darunter fallen die Kosten für z.B. Wäscherei."]
[null,"Ausrichterzuschuss",null,"gibt es entsprechend der Kostenerstattungsordnung des TTBW bei Veranstaltungen auf BaWü- oder DTTB-Ebene und bei Turnieren (wenn ein Verein Ausrichter ist)."]
[null,"Geschenke",null,"Dazu zählen z.B. Medaillen und Urkunden, oder auch andere Geschenke bei der Veranstaltung."]
[null,"Sonstiges",null,"Für alles, was es sonst noch geben könnte: das entsprechende Sachkonto muss dann selbst in Erfahrung gebracht  und eingetragen werden."]
[]
[null,"Blatt 7",null,"7 Turnierleitung+Schiri"]
[null,null,null,"Dieses Blatt ist nur auszufüllen bei eigenen Veranstaltungen, wenn Turnierleitung und/oder Schiedsrichter vom TTBW gestellt und bezahlt werden."]
[null,null,null,"Es sind Felder für 4 x 3 Tage,  10 x 2 Tage und 40 x 1 Tag vorgesehen, insgesamt also für 54 Personen. Sollte das nicht ausreichen, wird auf Wunsch eine spezielle Erweiterung erstellt."]
[null,"Namen / Wohnort",null,"Alle Personen sind hier aufzuführen: Turnierleitung, Oberschiedsrichter, Schiedsrichter."]
[null,null,null,"Die entsprechenden Kreuze sind zu setzen."]
[null,"Fahrer",null,"Wenn Fahrgemeinschaften gebildet wurden, ist beim Fahrer das Kreuz zu setzen."]
[null,"Tagegeld",null,"Kreuz machen, wenn Tagegeld zusteht und erwartet wird."]
[null,"Datum / Reise",null,"Hier gilt das gleiche, wie im Blatt 5."]
[null,"Hotelkosten",null,"Betrag der beigelegten Rechnung. Wenn Frühstück enthalten, dann Kreuz setzen."]
[]
[null,"Blätter 8 und 9",null,"8 Empfangsblatt Team    /  9 Empfangsblatt TL+Schiri"]
[null,null,null,"Wie oben schon gesagt, sind diese Blätter bei der Veranstaltung von den Spielern, Betreuern usw. unterschreiben zu lassen. Evtl. notwendige Korrekturen sind in den entsprechenden Spalten einzutragen und gleich bei der Auszahlung zu berücksichtigen."]
[]
[null,"Blatt 10",null,"10 Auszahl-Beschein"]
[null,null,null,"Auch dazu wurde oben unter \"Anwendung und Ablauf\" alles schon gesagt."]
[]
[null,"Blatt 2",null,"2 Zusammenstellung: "]
[null,null,null,"Alle bei der Veranstaltung bekannt gewordenen Korrekturen (Blätter 8 und 9) müssen in die entsprechenden Berechnungsblättern übertragen werden. Danach sind auf Blatt 2 alle Übertragungen auf Korrektheit zu überprüfen (vorerst notwendig um evtl. noch vorhandene Rechenfehler herauszufinden)."]
[null,"Abrechnung Deli:",null,"Wenn Vorschuss nicht direkt von TTBW-Kasse, sondern von einem zuständigen Ressortleiter gekommen ist, ist das Feld \"Auslagen Delegationsleiter\" auszufüllen. Der errechnete Differenzbetrag ist mit dem RL abzurechnen."]
[null,"Abrechnung TTBW-Kasse",null,"Hier müsste der Differenzbetrag zum Vorschuss automatisch errechnet werden. Die komplette Abrechnung ist mit Belegen an die GS-TTVW zu schicken; vorher aber unterschreiben."]

{"sheet":"12 Historie","index":11,"n_rows":71,"n_cols":6,"rows_kept":71,"cut":false,"hidden":true,"merged":[[62,1,62,2],[62,3,62,5],[64,1,64,2],[64,3,64,5],[0,1,0,5],[3,1,3,5],[60,1,60,4],[61,1,61,2],[61,3,61,5],[1,2,1,5],[70,1,70,2],[70,3,70,5],[65,1,65,2],[65,3,65,5],[63,1,63,2],[63,3,63,5],[69,1,69,2],[69,3,69,5],[68,1,68,2],[68,3,68,5],[67,1,67,2],[67,3,67,5],[66,1,66,2],[66,3,66,5]]}
[null,"Veranstaltungs-Abrechnung"]
[null,"Formular:","FO_TTBW-07e Abr-Veranst "]
[]
[null,"Versionsdokumentation"]
[]
[null,"Version","Datum","Autor","Blatt","Aktion / Änderung"]
[null,"2.1","2011-03-14",null,"komplett","Versand an TTBW Präsidium, Spichal, Kaltenbach Wörner, Weiland"]
[null,"2.2","2011-03-25","W. Renz","1 Deckblatt","Spalten angepasst und angeglichen: Name und Vorname getrennt, Wohnort links und rechts gleiche Spaltenanzahl => damit reinkopieren aus Datenbank möglich;"]
[null,null,null,null,null,"Spieler zusammengefasst: keine Unterteilung in männlich und weiblich; damit insgesamt für 32 Spieler ausgelegt;"]
[null,null,null,null,null,"Betreuer-Anzahl bei \"Sonstige\" auf 4 erweitert"]
[null,null,null,null,"2 Zusammenstellung","Box \"Abrechnung Delegationsleiter\" mit x-Spalte für Abzüge erweitert; damit kann Wert-Bezug nicht überschrieben werden;"]
[null,null,null,null,"4 Honorar + TG","um 1 Eintrag erweitert"]
[null,null,null,null,"5 Fahrgeld","Aufteilung Spieler / Betreuer angepasst;"]
[null,null,null,null,"7 TL + Schiri","Eintragfelder um 2 vergrößert; jetzt 14 statt 10 Personen mit Übernachtung möglich"]
[null,null,null,null,null,"mehrere Prüf-Routinen eingebaut und Eingabe-/ Fehleranzeigen verbessert"]
[null,null,null,null,"8, 9, 10","den Änderunger der Eingabe-Seiten angepasst"]
[null,null,null,null,"11 Anleitung","externe Anleitung integriert und verbessert"]
[null,"3.0","2011-03-28","W. Renz","A-Mappe","Versand an Fürste, Nagel, Geil, Graf, Franke"]
[null,"3.1","2011-03-30","W. Renz","6 Sonstige Kosten","Format-Fehler: Bewirtung (Einzug = 0) "]
[null,null,null,null,"8 Empf.Blatt Team","bei Spieler keine Eingabe Reisezeit (Format gesperrt)"]
[null,null,null,null,"2 Zusammenstellung","Kerrektur Delegationleiter (nicht Deligation...)"]
[null,null,null,null,"alle","Nullwerte ausblenden (Zellen mit 0,00 bleiben leer)"]
[null,"3.2","2011-04-10","W. Renz","alle","kosmetische Verbesserung der Tabellen (Stricharten)"]
[null,null,null,null,"4 Honorar + TG","bei Delegationsleiter in Blatt 1 >> Honorar-Berechnung möglich"]
[null,null,null,null,"5 + 7","km ohne Kommastelle; Nullwert anzeigen  (sonst ist 0,00 ausgeblendet)"]
[null,null,null,null,"10  Auszahl-Besch","Fehler auf 1. Beleg beseitigt (doppelter Wohnort)"]
[null,"3.3","2011-05-13","W. Renz","7 TL + Schiri","Formelfehler in Zellen X26 und X30 behoben: Feldgröße)"]
[null,"3.4","2011-05-18","W. Renz","1 Deckblatt","Vollständigkeits-Prüfung: Käschen und Gelb-Markierung"]
[null,null,null,null,"9 Empfangsblatt TL+Schi","Format-Korrektur im Datum"]
[null,"3.5","2011-06-05","W. Renz","2 Zusammenstellung","Sonstige Kosten (Team) werden aus den Seiten 5 und 6 übernommen"]
[null,"3.6","2011-07-08","W. Renz","2 Zusammenstellung","km-Geld für Spieler gestrichen (Zeile bleibt vorerst noch in der Darstellung)"]
[null,null,null,null,null,"zu Honorartrainer kommt jetzt ach der Delegationsleiter (Deli)"]
[null,null,null,null,"4 Honorar und Tagegeld","Spaltenüberschrift Honorartrainer wird Trainer + Deli"]
[null,null,null,null,"5 Fahrgeld + s.A.","Spaltenüberschrift Honorartrainer wird Trainer + Deli; Funktionäre wird ehrenamtl. MA;"]
[null,null,null,null,null,"und die km-Sätze auf 30 c angehoben und bei Spielern auf Null gesetzt;"]
[null,null,null,null,null,"die Zellen Fahrkosten bei Spielern gelöscht und gesperrt; Summe FG Spieler gelöscht;"]
[null,null,null,null,"7 TL + Schiri","Kilometersatz von 25 auf 30 c angehoben"]
[null,"3.7","2011-07-10","W. Renz","7 TL + Schiri","Formelfehler in X30 beseitigt (Zellbezug war 3 statt 2 Zellen)"]
[null,"3.8","2011-09-02","W. Renz","6 Sonstige Kosten","Beleg-Nummern \"mittig\"; in Summen-Beträgen \"Tausender-Punkt\""]
[null,null,"2011-09-07","W. Renz","1 Deckblatt","Auswahleingaben für Funktion: Verantwortlicher / Delegationsleiter"]
[null,null,"2011-09-13","W. Renz","1 Deckblatt","Einfache Prüfung der Eingabe einer Kostenstellen-Nummer."]
[null,"3.9","2011-10-14","W. Renz","5 Fahrgeld + s.A.","Doppelte Summe für \"FK: km-Geld Ehrenamtliche\" entfernt."]
[null,null,null,null,"6 Sonstige Kosten","Prüfung \"Sonstige Kosten\" >> Anweisung: übertragen SK-Nummer auf Blatt 2"]
[null,"3.10","2011-10-30","W. Renz","2 Zusammenstellung","Sachkonten-Nummern berichtigt; km-Geld bei Ehrenamtlichen Eintrag berichtigt"]
[null,"3.11","2012-01-03","W. Renz","2 Zusammenstellung","Abrechnung DL: in F36 erweitert um Kosten Sportschule"]
[null,"3.12","2012-02-21","W. Renz","5. Fahrgeld","Fehler in Trainerbezügen korrigiert: D18, E22, E23"]
[null,"3.13","2012-02-23","W. Renz","4 Honorar und Tagegeld","Anzal Trainer/Betreuer für 5 Tage auf fünf erhöht (vorher nur 3)"]
[null,"3.14","2012-03-08","W. Renz","1 Deckblatt","Zellformatierung korrigiert; Einträge bei \"unvollständig\" entfernt"]
[null,"3.15","2013-02-07","W. Renz","5 Fahrgeld","Lehrgangsgebühr von 12,00 zu 15,00 € geändert (N8) nur Text in Überschrift"]
[null,"3.16","2013-04-09","W. Renz","2 Zusammenstellung","Tabellenüberschriften angepasst: linksbündig bzw. mittig"]
[null,"3.17","2014-07-12","W. Renz","alle Blätter","Blattschutz ohne PW; für Blattschutz: Einfügemöglichkeit; SEPA-Bankdaten"]
[null,"4.0","2014-07-12","W. Renz","4 Honorar und Tagegeld","Reisekostensätze geändert: 20 : 40 : 40 %"]
[null,"4.1","2014-08-21","W. Renz","1 Deckblatt","BLZ und Konto-Nr. ersetzt durch BIC bzw. IBAN"]
[null,"4.2","2014-10-25","W. Renz","2 Zusammenstellung","Zeile 28: Teilnehmergebühren entspr. Gebührenordnung"]
[null,"4.3","2014-11-19","W. Renz","1 Deckblatt","Zelle M51 Verbindung aufgelöst"]
[null,"4.4","2014-12-01","W. Renz","6 Sonsige Kosten","Schriftgröße war unerschiedlich: allgemein 11"]
[null,null,null,null,"2 Zusammenstellung","Anmekung zu TN-Gebühren 7,50 / 15,00"]
[]
[]
[]
[null,"Planungen"]
[null,"8 Empfangsblatt-Team:",null,"TN/LG-Gebühren und Sonstige Kosten sollten aufgeführt  und in der Summe berücksichtigt werden. Sonst besteht die Gefahr, dass nicht korrekt ausbezahlt bzw. kassiert wird, weil zumeist nur das Unterschriftsblatt bei der Veranstaltung vorliegt."]
[null,"1 Deckblatt",null,"Eingabe der Kostenstellen-Nummer über Auswahlmenü."]
[null,"2 Zusammenstellung",null,"Unterteilung Reisekosten: DL /Trainer/Betreuer 0,25   und Schiedsrichter/ehenamtl. MA  0,30   (oder Schiri auch 0,25   ??)"]
[null,"7 Turnierleitung+Schiri",null,"Bessere Aufteilung: auf 2 Blätter; alle für mind. 2 Tage, Platz für Beleg (Hotel); Hinweis Regelung für Mehrtägig: 2 x 1-Tag / 2 Tage"]
[null,"9 Empfangsblatt TL+Schiri",null,"Hotel-Kosten mit aufführen"]
[null,"3 Auszahlung-Zusamm.",null,"Sachkonten für TL + Schiris  aufnehmen"]
[null,"4 Honorar und Tagegeld",null,"Abzüge-Berechnung vereinfachen: sind jetzt überall gleich 20/20/40 %"]
[null,"10 Auszahl-Beschein",null,"Erweitert um Schiedsrichter-Quittungen mit Steuer-Hinweis  (evtl. neues Blatt)"]
[null,"2 Zusammenstellung",null,"Differenzieren: Teilnehmergebühren 7,50 / 15,00 pro Tag  >> automatisieren über K.Stellen-Nummern"]
[null,"Neues Blatt",null,"Quittungen für Schiedsrichter"]